Cytosine
- Formula: C4H5N3O
- Molecular weight: 111.1020
- IUPAC Standard InChIKey: OPTASPLRGRRNAP-UHFFFAOYSA-N
- CAS Registry Number: 71-30-7
- Chemical structure:

Condensed phase thermochemistry data

Data compiled as indicated in comments:
ALS - Hussein Y. Afeefy, Joel F. Liebman, and Stephen E. Stein
DH - Eugene S. Domalski and Elizabeth D. Hearing
Quantity | Value | Units | Method | Reference | Comment |
---|---|---|---|---|---|
ΔfH°solid | -221.3 ± 2.3 | kJ/mol | Ccb | Wilson, Watson, et al., 1979 | ALS |
ΔfH°solid | -235.43 ± 0.46 | kJ/mol | Ccr | Sabbah, Nabavian, et al., 1977 | ALS |
Quantity | Value | Units | Method | Reference | Comment |
ΔcH°solid | -2067.3 ± 2.0 | kJ/mol | Ccb | Wilson, Watson, et al., 1979 | ALS |
ΔcH°solid | -2053.18 ± 0.37 | kJ/mol | Ccr | Sabbah, Nabavian, et al., 1977 | ALS |
Constant pressure heat capacity of solid
Cp,solid (J/mol*K) | Temperature (K) | Reference | Comment |
---|---|---|---|
132.6 | 298. | Kilday, 1978 | DH |

Phase change data

Data compiled as indicated in comments:
AC - William E. Acree, Jr., James S. Chickos
ALS - Hussein Y. Afeefy, Joel F. Liebman, and Stephen E. Stein
Quantity | Value | Units | Method | Reference | Comment |
---|---|---|---|---|---|
ΔsubH° | 155.0 ± 3.0 | kJ/mol | N/A | Burkinshaw and Mortimer, 1984 | AC |
ΔsubH° | 167. ± 10. | kJ/mol | TE | Ferro, Bencivenni, et al., 1980 | AC |
ΔsubH° | 176. ± 10. | kJ/mol | C | Sabbah, 1980 | ALS |
ΔsubH° | 176. ± 10. | kJ/mol | C | Sabbah, 1980 | Based on data from 450. to 470. K.; AC |
Enthalpy of sublimation
ΔsubH (kJ/mol) | Temperature (K) | Method | Reference | Comment |
---|---|---|---|---|
167.7 ± 0.5 | 365. | QR,ME | de Barros, Medina, et al., 2006 | Based on data from 320. to 410. K.; AC |
151.7 ± 0.7 | 505. to 525. | GS | Zielenkiewicz, Wszelaka-Rylik, et al., 1998 | AC |
147.2 ± 2.6 | 453. | ME | Burkinshaw and Mortimer, 1984 | Based on data from 423. to 483. K.; AC |

Gas phase ion energetics data

Data evaluated as indicated in comments:
HL - Edward P. Hunter and Sharon G. Lias
Data compiled as indicated in comments:
LLK - Sharon G. Lias, Rhoda D. Levin, and Sherif A. Kafafi
RDSH - Henry M. Rosenstock, Keith Draxl, Bruce W. Steiner, and John T. Herron
B - John E. Bartmess
Quantity | Value | Units | Method | Reference | Comment |
---|---|---|---|---|---|
Proton affinity (review) | 949.9 | kJ/mol | N/A | Hunter and Lias, 1998 | HL |
Quantity | Value | Units | Method | Reference | Comment |
Gas basicity | 918. | kJ/mol | N/A | Hunter and Lias, 1998 | HL |
Electron affinity determinations
EA (eV) | Method | Reference | Comment |
---|---|---|---|
2.34 ± 0.10 | LPES | Li, Bowen, et al., 2007 | valence state of rare tautomer(H from NH2 to C5), inferred based on calculations; B |
0.2300 ± 0.0080 | LPES | Schiedt, Weinkauf, et al., 1998 | amino-oxo form. Dipole bound state; B |
0.0850 ± 0.0080 | LPES | Schiedt, Weinkauf, et al., 1998 | amino-hydroxy form. Dipole bound state; B |
Ionization energy determinations
IE (eV) | Method | Reference | Comment |
---|---|---|---|
8.45 | PE | Dougherty, Younathan, et al., 1978 | LLK |
9.0 ± 0.1 | EI | Verkin, Sukodub, et al., 1976 | LLK |
8.9 ± 0.2 | EI | Lifschitz, Bergmann, et al., 1967 | RDSH |
8.94 ± 0.03 | PE | Hush and Cheung, 1975 | Vertical value; LLK |

Gas phase thermochemistry data

Data compiled by: Hussein Y. Afeefy, Joel F. Liebman, and Stephen E. Stein
Quantity | Value | Units | Method | Reference | Comment |
---|---|---|---|---|---|
ΔfH°gas | -59. ± 10. | kJ/mol | Cm | Sabbah, 1980 |

Reaction thermochemistry data

Data compiled as indicated in comments:
M - Michael M. Meot-Ner (Mautner) and Sharon G. Lias
RCD - Robert C. Dunbar
Individual Reactions
By formula: C4H6N3O+ + C4H5N3O = (C4H6N3O+ • C4H5N3O)
Quantity | Value | Units | Method | Reference | Comment |
---|---|---|---|---|---|
ΔrH° | 160. | kJ/mol | PHPMS | Meot-Ner (Mautner), 1979 | gas phase; M |
Quantity | Value | Units | Method | Reference | Comment |
ΔrS° | 150. | J/mol*K | PHPMS | Meot-Ner (Mautner), 1979 | gas phase; M |
By formula: Na+ + C4H5N3O = (Na+ • C4H5N3O)
Quantity | Value | Units | Method | Reference | Comment |
---|---|---|---|---|---|
ΔrH° | 177. | kJ/mol | CIDC | Cerda and Wesdemiotis, 1996 | RCD |
By formula: K+ + C4H5N3O = (K+ • C4H5N3O)
Quantity | Value | Units | Method | Reference | Comment |
---|---|---|---|---|---|
ΔrH° | 110. | kJ/mol | CIDC | Cerda and Wesdemiotis, 1996 | RCD |

Ion clustering data

Data compiled as indicated in comments:
M - Michael M. Meot-Ner (Mautner) and Sharon G. Lias
RCD - Robert C. Dunbar
Clustering reactions
By formula: C4H6N3O+ + C4H5N3O = (C4H6N3O+ • C4H5N3O)
Quantity | Value | Units | Method | Reference | Comment |
---|---|---|---|---|---|
ΔrH° | 160. | kJ/mol | PHPMS | Meot-Ner (Mautner), 1979 | gas phase; M |
Quantity | Value | Units | Method | Reference | Comment |
ΔrS° | 150. | J/mol*K | PHPMS | Meot-Ner (Mautner), 1979 | gas phase; M |
By formula: K+ + C4H5N3O = (K+ • C4H5N3O)
Quantity | Value | Units | Method | Reference | Comment |
---|---|---|---|---|---|
ΔrH° | 110. | kJ/mol | CIDC | Cerda and Wesdemiotis, 1996 | RCD |
By formula: Na+ + C4H5N3O = (Na+ • C4H5N3O)
Quantity | Value | Units | Method | Reference | Comment |
---|---|---|---|---|---|
ΔrH° | 177. | kJ/mol | CIDC | Cerda and Wesdemiotis, 1996 | RCD |

References

Wilson, Watson, et al., 1979
Wilson, S.R.; Watson, I.D.; Malcolm, G.N.,
Enthalpies of formation of solid cytosine, L-histidine, and uracil,
J. Chem. Thermodyn., 1979, 11, 911-912. [all data]
Sabbah, Nabavian, et al., 1977
Sabbah, R.; Nabavian, M.; Laffitte, M.,
Sur l'enthalpie de formation de la cytosine a 1'etat solide.,
C. R. Acad. Sci. Paris, 1977, 284, 953-954. [all data]
Kilday, 1978
Kilday, M.V.,
Enthalpies of solution of the nucleic acid bases. 3. Cytosine in water,
J. Res., 1978, NBS 83, 539-546. [all data]
Burkinshaw and Mortimer, 1984
Burkinshaw, Philip M.; Mortimer, Colin T.,
Enthalpies of sublimation of transition metal complexes,
J. Chem. Soc., Dalton Trans., 1984, 1, 75, https://doi.org/10.1039/dt9840000075
. [all data]
Ferro, Bencivenni, et al., 1980
Ferro, D.; Bencivenni, L.; Teghil, R.; Mastromarino, R.,
Vapour pressures and sublimation enthalpies of thymine and cytosine,
Thermochimica Acta, 1980, 42, 1, 75-83, https://doi.org/10.1016/0040-6031(80)87117-6
. [all data]
Sabbah, 1980
Sabbah, R.,
Thermodynamics of nitrogen compounds. V. Thermochemical study of cytosine,
Thermochim. Acta, 1980, 35, 73-77. [all data]
de Barros, Medina, et al., 2006
de Barros, A.L.F.; Medina, A.; Zappa, F.; Pereira, J.M.; Bessa, E.; Martins, M.H.P.; Coelho, L.F.S.; Wolff, W.; de Castro Faria, N.V.,
A simple experimental arrangement for measuring the vapour pressures and sublimation enthalpies by the Knudsen effusion method: Application to DNA and RNA bases,
Nuclear Instruments and Methods in Physics Research Section A: Accelerators, Spectrometers, Detectors and Associated Equipment, 2006, 560, 2, 219-223, https://doi.org/10.1016/j.nima.2006.01.026
. [all data]
Zielenkiewicz, Wszelaka-Rylik, et al., 1998
Zielenkiewicz, A.; Wszelaka-Rylik, M.; Poznanski, J.; Zielenkiewicz, W.,
Journal of Solution Chemistry, 1998, 27, 3, 235-243, https://doi.org/10.1023/A:1022636218154
. [all data]
Hunter and Lias, 1998
Hunter, E.P.; Lias, S.G.,
Evaluated Gas Phase Basicities and Proton Affinities of Molecules: An Update,
J. Phys. Chem. Ref. Data, 1998, 27, 3, 413-656, https://doi.org/10.1063/1.556018
. [all data]
Li, Bowen, et al., 2007
Li, X.; Bowen, K.H.; Haranczyk, M.; Bachorz, R.A.; Mazurkiewicz, K.; Rak, J.; Gutowski, M.,
Photoelectron spectroscopy of adiabatically bound valence anions of rare tautomers of the nucleic acid bases,
J. Chem. Phys., 2007, 127, 17, 174309, https://doi.org/10.1063/1.2795719
. [all data]
Schiedt, Weinkauf, et al., 1998
Schiedt, J.; Weinkauf, R.; Neumark, D.M.; Schlag, E.W.,
Anion spectroscopy of uracil, thymine and the amino-oxo and amino-hydroxy tautomers of cytosine and their water clusters,
Chem. Phys., 1998, 239, 1-3, 511-524, https://doi.org/10.1016/S0301-0104(98)00361-9
. [all data]
Dougherty, Younathan, et al., 1978
Dougherty, D.; Younathan, E.S.; Voll, R.; Abdulnur, S.; McGlynn, S.P.,
Photoelectron spectroscopy of some biological molecules,
J. Electron Spectrosc. Relat. Phenom., 1978, 13, 379. [all data]
Verkin, Sukodub, et al., 1976
Verkin, B.I.; Sukodub, L.F.; Yanson, I.K.,
Ionization potentials of nitrogenous bases of of nucleic acids,
Dokl. Akad. Nauk SSSR, 1976, 228, 1452. [all data]
Lifschitz, Bergmann, et al., 1967
Lifschitz, C.; Bergmann, E.D.; Pullman, B.,
The ionization potentials of biological purines and pyrimidines,
Tetrahedron Lett., 1967, 4583. [all data]
Hush and Cheung, 1975
Hush, N.S.; Cheung, A.S.,
Ionization potentials and donor properties of nucleic acid bases and related compounds,
Chem. Phys. Lett., 1975, 34, 11. [all data]