1,3,5-Cycloheptatriene,7-(2-phenylethyl)-
- Formula: C15H16
- Molecular weight: 196.2875
- IUPAC Standard InChIKey: CHBFHNUTCRRSGB-UHFFFAOYSA-N
- CAS Registry Number: 71275-32-6
- Chemical structure:
View 3d structure (requires JavaScript / HTML 5) - Permanent link for this species. Use this link for bookmarking this species for future reference.

Gas phase ion energetics data

Data compiled by: Sharon G. Lias, Rhoda D. Levin, and Sherif A. Kafafi
Ionization energy determinations
IE (eV) | Method | Reference |
---|---|---|
8.06 ± 0.05 | EI | Kuck and Grutzmacher, 1979 |
Appearance energy determinations
Ion | AE (eV) | Other Products | Method | Reference | Comment |
---|---|---|---|---|---|
C7H7+ | 9.3 ± 0.1 | ? | EI | Kuck and Grutzmacher, 1979 | |
C7H8+ | 9.0 ± 0.1 | ? | EI | Kuck and Grutzmacher, 1979 | |
C8H8+ | 9.3 ± 0.2 | ? | EI | Kuck and Grutzmacher, 1979 | |
C8H9+ | 8.95 ± 0.05 | ? | EI | Kuck and Grutzmacher, 1979 |

References

Kuck and Grutzmacher, 1979
Kuck, D.; Grutzmacher, H.-Fr.,
The activation energy of the skeletal isomerization in the radical cations of toluene and cycloheptatriene by mass spectrometry of their 2-phenylethyl derivatives,
Org. Mass Spectrom., 1979, 14, 86. [all data]