Bicyclo[3.2.2]non-6-ene
- Formula: C9H14
- Molecular weight: 122.2075
- IUPAC Standard InChIKey: JBAWYNWUHODEAV-UHFFFAOYSA-N
- CAS Registry Number: 7124-86-9
- Chemical structure:
View 3d structure (requires JavaScript / HTML 5) - Permanent link for this species. Use this link for bookmarking this species for future reference.

Gas phase thermochemistry data

Data compiled by: Hussein Y. Afeefy, Joel F. Liebman, and Stephen E. Stein
Quantity | Value | Units | Method | Reference | Comment |
---|---|---|---|---|---|
ΔfH°gas | -3.5 ± 2.3 | kJ/mol | Ccb | Jochem, Dekker, et al., 1983 |

Condensed phase thermochemistry data

Data compiled by: Hussein Y. Afeefy, Joel F. Liebman, and Stephen E. Stein
Quantity | Value | Units | Method | Reference | Comment |
---|---|---|---|---|---|
ΔfH°solid | -51.5 ± 2.1 | kJ/mol | Ccb | Jochem, Dekker, et al., 1983 | |
Quantity | Value | Units | Method | Reference | Comment |
ΔcH°solid | -5490.9 ± 2.1 | kJ/mol | Ccb | Jochem, Dekker, et al., 1983 | Corresponding ΔfHºsolid = -51.5 kJ/mol (simple calculation by NIST; no Washburn corrections) |

Phase change data

Data compiled as indicated in comments:
ALS - Hussein Y. Afeefy, Joel F. Liebman, and Stephen E. Stein
DRB - Donald R. Burgess, Jr.
AC - William E. Acree, Jr., James S. Chickos
Quantity | Value | Units | Method | Reference | Comment |
---|---|---|---|---|---|
ΔsubH° | 48.0 ± 1.0 | kJ/mol | V | Jochem, Dekker, et al., 1983 | ALS |
ΔsubH° | 48.0 | kJ/mol | N/A | Jochem, Dekker, et al., 1983 | DRB |
ΔsubH° | 48. ± 1.0 | kJ/mol | C | Jochems, Dekker, et al., 1982 | AC |

Gas phase ion energetics data

Data compiled as indicated in comments:
LLK - Sharon G. Lias, Rhoda D. Levin, and Sherif A. Kafafi
Ionization energy determinations
IE (eV) | Method | Reference | Comment |
---|---|---|---|
8.7 | PE | Goldstein, Natowsky, et al., 1973 | LLK |
8.95 | PE | Goldstein, Natowsky, et al., 1973 | Vertical value; LLK |

References

Jochem, Dekker, et al., 1983
Jochem, R.; Dekker, H.; Mosselman, C.; Soumen, G.,
J. Chem. Thermodyn., 1983, 15, 95. [all data]
Jochems, Dekker, et al., 1982
Jochems, R.; Dekker, H.; Mosselman, C.; Somsen, G.,
Enthalpies of sublimation of bicyclo[3.3.1]non-2-ene, bicyclo[3.2.2]non-6-ene, and bicyclo[4.2.1]non-3-ene,
J. Chem. Thermodyn., 1982, 14, 799-800. [all data]
Goldstein, Natowsky, et al., 1973
Goldstein, M.J.; Natowsky, S.; Heilbronner, E.; Hornung, V.,
Near cancellation of through space and through bond interaction in bicyclo[3.2.2]nona-6,8-diene,
Helv. Chim. Acta, 1973, 56, 294. [all data]