8,9-Dioxabicyclo[5.2.1]decane, 10-bromo-
- Formula: C8H13BrO2
- Molecular weight: 221.092
- IUPAC Standard InChIKey: WVYNLCUPHHESLV-UHFFFAOYSA-N
- CAS Registry Number: 71245-79-9
- Chemical structure:
View 3d structure (requires JavaScript / HTML 5) - Permanent link for this species. Use this link for bookmarking this species for future reference.

Gas phase ion energetics data

Data compiled by: Sharon G. Lias, John E. Bartmess, Joel F. Liebman, John L. Holmes, Rhoda D. Levin, and W. Gary Mallard
Ionization energy determinations
IE (eV) | Method | Reference | Comment |
---|---|---|---|
9.6 | PE | Gleiter, Dobler, et al., 1984 | Vertical value |

References

Gleiter, Dobler, et al., 1984
Gleiter, R.; Dobler, W.; Eckert-Maksic, M.; Bloodworth, A.J.; Eggelte, H.J.; Cremer, D.,
Photoelectron spectra of dioxabicyclo[n.2.1]alkanes,
J. Org. Chem., 1984, 49, 3716. [all data]