Propane, 2-bromo-2-nitroso-
- Formula: C3H6BrNO
- Molecular weight: 151.990
- IUPAC Standard InChIKey: COYCABGGLZMKCV-UHFFFAOYSA-N
- CAS Registry Number: 7119-91-7
- Chemical structure:
View 3d structure (requires JavaScript / HTML 5) - Permanent link for this species. Use this link for bookmarking this species for future reference.

Phase change data

Data compiled by: William E. Acree, Jr., James S. Chickos
Enthalpy of vaporization
ΔvapH (kJ/mol) | Temperature (K) | Method | Reference | Comment |
---|---|---|---|---|
41.0 | 254. | A | Stephenson and Malanowski, 1987 | Based on data from 239. to 356. K. See also Dykyj, 1970. |

Gas phase ion energetics data

Data compiled by: Sharon G. Lias, Rhoda D. Levin, and Sherif A. Kafafi
Appearance energy determinations
Ion | AE (eV) | Other Products | Method | Reference | Comment |
---|---|---|---|---|---|
HBr+ | 11.60 | ? | EI | Day, Gowenlock, et al., 1978 | |
CH3+ | 11.95 | ? | EI | Day, Gowenlock, et al., 1978 | |
C2H3+ | 14.45 | ? | EI | Day, Gowenlock, et al., 1978 | |
C2H4NO+ | 10.10 | ? | EI | Day, Gowenlock, et al., 1978 | |
C2H5+ | 13.25 | ? | EI | Day, Gowenlock, et al., 1978 | |
C3H3+ | 13.80 | ? | EI | Day, Gowenlock, et al., 1978 | |
C3H4+ | 11.80 | ? | EI | Day, Gowenlock, et al., 1978 | |
C3H5+ | 11.15 | ? | EI | Day, Gowenlock, et al., 1978 | |
C3H5Br+ | 9.25 | ? | EI | Day, Gowenlock, et al., 1978 | |
C3H5NO+ | 10.60 | ? | EI | Day, Gowenlock, et al., 1978 | |
C3H6+ | 11.15 | ? | EI | Day, Gowenlock, et al., 1978 | |
C3H6NO+ | 10.35 | ? | EI | Day, Gowenlock, et al., 1978 | |
C3H7+ | 11.25 | ? | EI | Day, Gowenlock, et al., 1978 | |
HNO+ | 12.75 | ? | EI | Day, Gowenlock, et al., 1978 | |
NO+ | 11.10 | ? | EI | Day, Gowenlock, et al., 1978 | |
N2O+ | 13.15 | ? | EI | Day, Gowenlock, et al., 1978 |

References

Stephenson and Malanowski, 1987
Stephenson, Richard M.; Malanowski, Stanislaw,
Handbook of the Thermodynamics of Organic Compounds, 1987, https://doi.org/10.1007/978-94-009-3173-2
. [all data]
Dykyj, 1970
Dykyj, J.,
Petrochemica, 1970, 10, 2, 51. [all data]
Day, Gowenlock, et al., 1978
Day, J.S.; Gowenlock, B.G.; Johnson, C.A.F.; McInally, I.D.; Pfab, J.,
Appearance potential studies of some geminal substituted C-nitroso- compounds,
J. Chem. Soc. Perkin Trans. 2, 1978, 10, 1110. [all data]