Thiirane, 1-oxide-
- Formula: C2H4OS
- Molecular weight: 76.118
- IUPAC Standard InChIKey: PCYCVCFVEKMHGA-UHFFFAOYSA-N
- CAS Registry Number: 7117-41-1
- Chemical structure:
View 3d structure (requires JavaScript / HTML 5) - Permanent link for this species. Use this link for bookmarking this species for future reference.

Gas phase ion energetics data

Data compiled as indicated in comments:
LLK - Sharon G. Lias, Rhoda D. Levin, and Sherif A. Kafafi
Ionization energy determinations
IE (eV) | Method | Reference | Comment |
---|---|---|---|
9.66 | PE | Bock and Solouki, 1974 | Vertical value; LLK |
9.66 | PE | Bock and Solouki, 1972 | Vertical value; LLK |

References

Bock and Solouki, 1974
Bock, H.; Solouki, B.,
Photoelektronenspektren und molekuleigenschaften, XXXV. Sulfoxide X2SO - beispiele fur den nutzen von korrelations - diagrammen bei der diskussion von substituenteneffekten und von geometrischen storungen,
Chem. Ber., 1974, 107, 2299. [all data]
Bock and Solouki, 1972
Bock, H.; Solouki, B.,
The sulfoxide bond,
Angew. Chem. Int. Ed. Engl., 1972, 11, 436. [all data]