Spirohex-1-ene
- Formula: C6H8
- Molecular weight: 80.1277
- IUPAC Standard InChIKey: MTADUJBFHBFCHU-UHFFFAOYSA-N
- CAS Registry Number: 71153-32-7
- Chemical structure:
View 3d structure (requires JavaScript / HTML 5) - Permanent link for this species. Use this link for bookmarking this species for future reference.

Gas phase ion energetics data

Data compiled by: Sharon G. Lias, Rhoda D. Levin, and Sherif A. Kafafi
Ionization energy determinations
IE (eV) | Method | Reference | Comment |
---|---|---|---|
8.7 | PE | Plemenkov, Villem, et al., 1981 | |
9.30 | PE | Plemenkov, Villem, et al., 1981 | Vertical value |

References

Plemenkov, Villem, et al., 1981
Plemenkov, V.V.; Villem, Y.Y.; Villem, N.V.; Bolesov, I.G.; Surmina, L.S.; Yakushkina, N.I.; Formanovskii, A.A.,
Photoelectron spectra of polyalkylcyclopropenes and polyalkylcyclopropanes,
Zh. Obshch. Khim., 1981, 51, 2076. [all data]