Methyl diselenide
- Formula: C2H6Se2
- Molecular weight: 187.99
- IUPAC Standard InChIKey: VLXBWPOEOIIREY-UHFFFAOYSA-N
- CAS Registry Number: 7101-31-7
- Chemical structure:
View 3d structure (requires JavaScript / HTML 5) - Other names: (CH3Se)2; Dimethyl diselenide; Diselenide, dimethyl

Condensed phase thermochemistry data

Data compiled by: Eugene S. Domalski and Elizabeth D. Hearing
Quantity | Value | Units | Method | Reference | Comment |
---|---|---|---|---|---|
S°liquid | 261.4 | J/mol*K | N/A | Rabinovich, Sheiman, et al., 1991 |
Constant pressure heat capacity of liquid
Cp,liquid (J/mol*K) | Temperature (K) | Reference | Comment |
---|---|---|---|
155.0 | 298.15 | Rabinovich, Sheiman, et al., 1991 | T = 5 to 300 K. |

Phase change data

Data compiled as indicated in comments:
TRC - Thermodynamics Research Center, NIST Boulder Laboratories, Chris Muzny director
AC - William E. Acree, Jr., James S. Chickos
DH - Eugene S. Domalski and Elizabeth D. Hearing
Quantity | Value | Units | Method | Reference | Comment |
---|---|---|---|---|---|
Ttriple | 190.89 | K | N/A | Rabinovich, Sheiman, et al., 1991, 2 | Uncertainty assigned by TRC = 0.01 K; TRC |
Quantity | Value | Units | Method | Reference | Comment |
ΔvapH° | 42.0 ± 1.0 | kJ/mol | C | Voronkov, Klyuchnikov, et al., 1989 | AC |
Enthalpy of vaporization
ΔvapH (kJ/mol) | Temperature (K) | Method | Reference | Comment |
---|---|---|---|---|
74.9 | 300. | I | Karlson, Frankenberger, et al., 1994 | Based on data from 288. to 313. K.; AC |
Enthalpy of fusion
ΔfusH (kJ/mol) | Temperature (K) | Reference | Comment |
---|---|---|---|
8.545 | 190.89 | Rabinovich, Sheiman, et al., 1991 | DH |
8.55 | 190.8 | Rabinovich, Sheiman, et al., 1991, 3 | AC |
Entropy of fusion
ΔfusS (J/mol*K) | Temperature (K) | Reference | Comment |
---|---|---|---|
44.76 | 190.89 | Rabinovich, Sheiman, et al., 1991 | DH |

Gas phase ion energetics data

Data compiled as indicated in comments:
LBLHLM - Sharon G. Lias, John E. Bartmess, Joel F. Liebman, John L. Holmes, Rhoda D. Levin, and W. Gary Mallard
LLK - Sharon G. Lias, Rhoda D. Levin, and Sherif A. Kafafi
Ionization energy determinations
IE (eV) | Method | Reference | Comment |
---|---|---|---|
8.1 | PE | Bock, Aygen, et al., 1984 | LBLHLM |
8.1 | PE | Hirabayashi, Mohmand, et al., 1982 | LBLHLM |
8.52 | PE | Chang, Young, et al., 1986 | Vertical value; LBLHLM |
8.56 | PE | Bock, Aygen, et al., 1984 | Vertical value; LBLHLM |
8.56 | PE | Tschmutowa and Bock, 1976 | Vertical value; LLK |

Normal alkane RI, non-polar column, isothermal

Column type | Active phase | Temperature (C) | I | Reference | Comment |
---|---|---|---|---|---|
Packed | SE-30 (10 %) + CW-20M (1 %) | 112. | 889. | Hillen and Werner, 1973 | Nitrogen, Chromosorb W DCMS (100-120 mesh); Column length: 2. m |
Packed | SE-30 (10 %) + CW-20M (1 %) | 50. | 848. | Hillen and Werner, 1973 | Nitrogen, Chromosorb W DCMS (100-120 mesh); Column length: 2. m |

References

Rabinovich, Sheiman, et al., 1991
Rabinovich, I.B.; Sheiman, M.S.; Kamelova, G.P.; Nistrotov, V.P.; Karataev, E.N.,
Heat capacity and thermodynamic functions of methyl derivatives of selenium,
Zhur. Fiz. Khim., 1991, 65, 2071-2076. [all data]
Rabinovich, Sheiman, et al., 1991, 2
Rabinovich, I.B.; Sheiman, M.S.; Kamelova, G.P.; Nistratov, V.P.; Karataev, E.N.,
Heat capacities and thermodynamic functions of methyl selenium compounds,
Zh. Fiz. Khim., 1991, 65, 2071-6. [all data]
Voronkov, Klyuchnikov, et al., 1989
Voronkov, M.G.; Klyuchnikov, V.A.; Kolabin, S.N.; Shvets, G.N.; Varushin, P.I.; Deryagina, E.N.; Korchevin, N.A.; Tsvetnitskaya, S.I.,
Thermochemical properties of dialkyl chalcogenides and dichalcogenides RMnR (M = sulfur, selenium, tellurium; n = 1, 2),
Dokl. Akad. Nauk SSSR, Phys. Chem., 1989, 307, 5, 1139. [all data]
Karlson, Frankenberger, et al., 1994
Karlson, U.; Frankenberger, W.T.; Spencer, W.F.,
Physicochemical properties of dimethyl selenide and dimethyl diselenide,
J. Chem. Eng. Data, 1994, 39, 3, 608-610, https://doi.org/10.1021/je00015a049
. [all data]
Rabinovich, Sheiman, et al., 1991, 3
Rabinovich, I.B.; Sheiman, M.S.; Kamelova, G.P.; Nistratov, V.P.; Karataev, E.N.,
Heat capacities and thermodynamic functions of methyl selenium compounds,
Zh. Fiz. Khim., 1991, 65, 8, 2071. [all data]
Bock, Aygen, et al., 1984
Bock, H.; Aygen, S.; Rosmus, P.; Solouki, B.; Weissflog, E.,
Gasphasen-reaktionen,40. Selenoformaldehyd: Hochkorrelierte wellenfunktion und photoelektronenspektroskopischer nachweis,
Chem. Ber., 1984, 117, 187. [all data]
Hirabayashi, Mohmand, et al., 1982
Hirabayashi, T.; Mohmand, S.; Bock, H.,
Thermische zersetzung ofenkettiger kialkyl-sulfide,-disulfide und -diselenide,
Chem. Ber., 1982, 115, 483. [all data]
Chang, Young, et al., 1986
Chang, F.C.; Young, V.Y.; Prather, J.W.; Cheng, K.L.,
Study of methyl chalcogen compounds with ultraviolet photoelectron spectroscopy,
J. Electron Spectrosc. Relat. Phenom., 1986, 40, 363. [all data]
Tschmutowa and Bock, 1976
Tschmutowa, G.; Bock, H.,
Photoelektronen-Spektren und Molekuleigenschaften, LXIII ionisierungsenergien von Phenyl-Methyl-Tellurid und Vergleich der Effekte von Sauerstoff-, Schwefel-, Selen- und Tellur-Substituenten auf das Benzol-π-System,
Z. Naturforsch. B:, 1976, 31, 1611. [all data]
Hillen and Werner, 1973
Hillen, L.W.; Werner, R.L.,
Correlation of retention index data for dimethyl polysulfides, polyselenides, and related thiaselena-alkanes,
J. Chromatogr., 1973, 79, 318-321, https://doi.org/10.1016/S0021-9673(01)85303-6
. [all data]