β-D-Glucopyranoside, methyl
- Formula: C7H14O6
- Molecular weight: 194.1825
- IUPAC Standard InChIKey: HOVAGTYPODGVJG-ZYNSJIGGSA-N
- CAS Registry Number: 709-50-2
- Chemical structure:
View 3d structure (requires JavaScript / HTML 5) - Stereoisomers:
- Other names: Glucopyranoside, methyl, β-D-; Methyl β-D-glucopyranoside; Methyl β-D-glucoside; 1-O-Methyl-β-D-glucopyranoside; β-d-Methylglucopyranoside; β-Methyl-(d)-glucoside

Condensed phase thermochemistry data

Data compiled by: Hussein Y. Afeefy, Joel F. Liebman, and Stephen E. Stein
Quantity | Value | Units | Method | Reference | Comment |
---|---|---|---|---|---|
ΔcH°solid | -3517.9 ± 0.42 | kJ/mol | Ccb | Skuratov, Strepikheev, et al., 1957 | Reanalyzed by Cox and Pilcher, 1970, Original value = -3519. ± 0.4 kJ/mol; Combustion at 293 K; Corresponding ΔfHºsolid = -1237.5 kJ/mol (simple calculation by NIST; no Washburn corrections) |

Gas phase ion energetics data

Data compiled by: Henry M. Rosenstock, Keith Draxl, Bruce W. Steiner, and John T. Herron
Appearance energy determinations
Ion | AE (eV) | Other Products | Method | Reference | Comment |
---|---|---|---|---|---|
C6H11O5+ | 13.5 ± 0.16 | CH3O | EI | Finan, Reed, et al., 1963 |

References

Skuratov, Strepikheev, et al., 1957
Skuratov, S.M.; Strepikheev, A.A.; Kozina, M.P.,
About the reaction activity of five and six-membered heterocyclic compounds,
Dokl. Akad. Nauk SSSR, 1957, 117, 452-454. [all data]
Cox and Pilcher, 1970
Cox, J.D.; Pilcher, G.,
Thermochemistry of Organic and Organometallic Compounds, Academic Press, New York, 1970, 1-636. [all data]
Finan, Reed, et al., 1963
Finan, P.A.; Reed, R.I.; Snedden, W.; Wilson, J.M.,
Electron impact and molecular dissociation. Part X. Some studies of glycosides,
J. Chem. Soc., 1963, 5945. [all data]