4-Aminofluorene
- Formula: C13H11N
- Molecular weight: 181.2331
- IUPAC Standard InChIKey: NNHRVRJFHLVIIV-UHFFFAOYSA-N
- CAS Registry Number: 7083-63-8
- Chemical structure:
View 3d structure (requires JavaScript / HTML 5) - Permanent link for this species. Use this link for bookmarking this species for future reference.

Gas phase ion energetics data

Data compiled as indicated in comments:
LBLHLM - Sharon G. Lias, John E. Bartmess, Joel F. Liebman, John L. Holmes, Rhoda D. Levin, and W. Gary Mallard
Ionization energy determinations
IE (eV) | Method | Reference | Comment |
---|---|---|---|
7.25 | PE | Gleiter, Schafer, et al., 1984 | LBLHLM |
7.6 | PE | Gleiter, Schafer, et al., 1984 | Vertical value; LBLHLM |

Lee's RI, non-polar column, temperature ramp

Column type | Active phase | I | Reference | Comment |
---|---|---|---|---|
Capillary | SE-52 | 325.11 | Vassilaros, Kong, et al., 1982 | 20. m/0.30 mm/0.25 μm, H2, 40. C @ 2. min, 4. K/min; Tend: 265. C |

References

Gleiter, Schafer, et al., 1984
Gleiter, R.; Schafer, W.; Staab, H.A.; Saupe, T.,
Electronic structure of 4,5-bis(dimethylamine)fluorene. PE spectroscopic investigations,
J. Org. Chem., 1984, 49, 4463. [all data]
Vassilaros, Kong, et al., 1982
Vassilaros, D.L.; Kong, R.C.; Later, D.W.; Lee, M.L.,
Linear retention index system for polycyclic aromatic compounds. Critical evaluation and additional indices,
J. Chromatogr., 1982, 252, 1-20, https://doi.org/10.1016/S0021-9673(01)88394-1
. [all data]