Tricyclo[4.2.1.02,5]non-3-ene
- Formula: C9H12
- Molecular weight: 120.1916
- IUPAC Standard InChIKey: XSKXEKKIOLQKBQ-UHFFFAOYSA-N
- CAS Registry Number: 7078-40-2
- Chemical structure:
View 3d structure (requires JavaScript / HTML 5) - Species with the same structure:
- Other names: Tricyclo[4.2.1.0(2,5)]non-7-ene

Gas phase ion energetics data

Data compiled by: Sharon G. Lias, Rhoda D. Levin, and Sherif A. Kafafi
Ionization energy determinations
IE (eV) | Method | Reference | Comment |
---|---|---|---|
9. | PE | Haselbach and Eberbach, 1973 | Vertical value |

References

Haselbach and Eberbach, 1973
Haselbach, E.; Eberbach, W.,
The photolysis of tricyclo[4.2.1.02,5]nonadiene: support of a Dougherty Type N' mechanism from photoelectron spectroscopical studies,
Helv. Chim. Acta, 1973, 56, 1944. [all data]