Bicyclo[4.1.1]octane
- Formula: C8H14
- Molecular weight: 110.1968
- IUPAC Standard InChIKey: QVAUSBVLMVBCPN-UHFFFAOYSA-N
- CAS Registry Number: 7078-34-4
- Chemical structure:
View 3d structure (requires JavaScript / HTML 5) - Permanent link for this species. Use this link for bookmarking this species for future reference.

Gas phase ion energetics data

Data compiled as indicated in comments:
LLK - Sharon G. Lias, Rhoda D. Levin, and Sherif A. Kafafi
Ionization energy determinations
IE (eV) | Method | Reference | Comment |
---|---|---|---|
9.6 | PE | Gleiter, Bischof, et al., 1977 | LLK |
10.0 | PE | Gleiter, Bischof, et al., 1977 | Vertical value; LLK |

References

Gleiter, Bischof, et al., 1977
Gleiter, R.; Bischof, P.; Volz, W.E.; Paquette, L.A.,
Conjugative interaction between II cyclobutane orbitals. The synthesis and electronic structure of bicyclo[4.1.1]octa-2,4-diene,
J. Am. Chem. Soc., 1977, 99, 8. [all data]