Benzene, 1-tert-butyl-2-chloro-
- Formula: C10H13Cl
- Molecular weight: 168.663
- IUPAC Standard InChIKey: HMRNLPCZVBVKLZ-UHFFFAOYSA-N
- CAS Registry Number: 7073-98-5
- Chemical structure:
View 3d structure (requires JavaScript / HTML 5) - Permanent link for this species. Use this link for bookmarking this species for future reference.

Condensed phase thermochemistry data

Data compiled by: Hussein Y. Afeefy, Joel F. Liebman, and Stephen E. Stein
Quantity | Value | Units | Method | Reference | Comment |
---|---|---|---|---|---|
ΔfH°liquid | -87. ± 2. | kJ/mol | Eqk | Kovel, Nesterova, et al., 1982 |

Reaction thermochemistry data

Data compiled by: Hussein Y. Afeefy, Joel F. Liebman, and Stephen E. Stein
Individual Reactions
By formula: C6H5Cl + C14H21Cl = C10H13Cl + C10H13Cl
Quantity | Value | Units | Method | Reference | Comment |
---|---|---|---|---|---|
ΔrH° | -0.25 ± 0.71 | kJ/mol | Eqk | Kovzel, Nesterova, et al., 1981 | liquid phase |
By formula: C10H13Cl = C10H13Cl
Quantity | Value | Units | Method | Reference | Comment |
---|---|---|---|---|---|
ΔrH° | -21.4 ± 1.7 | kJ/mol | Eqk | Kovzel, Nesterova, et al., 1981 | liquid phase |

Gas phase ion energetics data

Data compiled by: Sharon G. Lias, John E. Bartmess, Joel F. Liebman, John L. Holmes, Rhoda D. Levin, and W. Gary Mallard
Ionization energy determinations
IE (eV) | Method | Reference | Comment |
---|---|---|---|
8.49 | PE | Baidin, Misharev, et al., 1985 | |
8.84 | PE | Baidin, Misharev, et al., 1985 | Vertical value |

References

Kovel, Nesterova, et al., 1982
Kovel, E.N.; Nesterova, T.N.; Rozhnov, A.M.,
Heats of formation of tert-butylchlorobenzenes, Deposited Document, SPSTL 385 Khp-D80. Chem. Abst. 97:23198n, 1982, 1-5. [all data]
Kovzel, Nesterova, et al., 1981
Kovzel, E.N.; Nesterova, T.N.; Rozhnov, A.M.; Kartavtseva, T.A.,
Study of equilibrium in in the chlorobenzene-butylchlorobenzenes systems,
Termodin. Organ. Soedin., 1981, 65-68. [all data]
Baidin, Misharev, et al., 1985
Baidin, V.N.; Misharev, A.D.; Takhistov, V.V.,
Effect of alkyl substituents on the ionization potentials of halogenobenzenes,
Zh. Org. Khim., 1985, 21, 817. [all data]