1,3,5,2,4,6-Triazatriphosphorine, 2,2,4,6-tetrakis(dimethylamino)-4,6-difluoro-
- Formula: C8H24F2N7P3
- Molecular weight: 349.2412
- IUPAC Standard InChIKey: OJAHPXQVHQJVBB-UHFFFAOYSA-N
- CAS Registry Number: 70660-01-4
- Chemical structure:
View 3d structure (requires JavaScript / HTML 5) - Permanent link for this species. Use this link for bookmarking this species for future reference.

Gas phase ion energetics data

Data compiled by: Sharon G. Lias, Rhoda D. Levin, and Sherif A. Kafafi
Ionization energy determinations
IE (eV) | Method | Reference |
---|---|---|
8.17 | EI | Clare and Sowerby, 1981 |

References

Clare and Sowerby, 1981
Clare, P.; Sowerby, D.B.,
Electron impact ionisation energies of some halo-cyclotriphosphazenes,
J. Inorg. Nucl. Chem., 1981, 43, 477. [all data]