Cyclohexane, (1-methylpropyl)-
- Formula: C10H20
- Molecular weight: 140.2658
- IUPAC Standard InChIKey: QTYARKOMFKRPSY-UHFFFAOYSA-N
- CAS Registry Number: 7058-01-7
- Chemical structure:
View 3d structure (requires JavaScript / HTML 5) - Stereoisomers:
- Other names: Cyclohexane, sec-butyl-; sec-Butylcyclohexane; 2-Cyclohexylbutane; s-Butylcyclohexane

Phase change data

Data compiled as indicated in comments:
BS - Robert L. Brown and Stephen E. Stein
TRC - Thermodynamics Research Center, NIST Boulder Laboratories, Chris Muzny director
AC - William E. Acree, Jr., James S. Chickos
Quantity | Value | Units | Method | Reference | Comment |
---|---|---|---|---|---|
Tboil | 452.5 | K | N/A | Weast and Grasselli, 1989 | BS |
Tboil | 452.48 | K | N/A | Forziati and Rossini, 1949 | Uncertainty assigned by TRC = 0.03 K; TRC |
Tboil | 452.9 | K | N/A | Smith and Pennekamp, 1945 | Uncertainty assigned by TRC = 0.5 K; TRC |
Tboil | 452.2 | K | N/A | Signaigo and Cramer, 1933 | Uncertainty assigned by TRC = 2. K; TRC |
Tboil | 450.3 | K | N/A | Timmermans, 1927 | Uncertainty assigned by TRC = 0.5 K; sourec or data not clear; TRC |
Enthalpy of vaporization
ΔvapH (kJ/mol) | Temperature (K) | Method | Reference | Comment |
---|---|---|---|---|
44.1 | 384. | A | Stephenson and Malanowski, 1987 | Based on data from 369. to 455. K. See also Forziati, Norris, et al., 1949.; AC |
Antoine Equation Parameters
log10(P) = A − (B / (T + C))
P = vapor pressure (bar)
T = temperature (K)
View plot Requires a JavaScript / HTML 5 canvas capable browser.
Temperature (K) | A | B | C | Reference |
---|---|---|---|---|
364.61 to 453.57 | 4.01397 | 1529.373 | -70.93 | Forziati, Norris, et al., 1949, 2 |

Gas phase ion energetics data

Data compiled as indicated in comments:
LBLHLM - Sharon G. Lias, John E. Bartmess, Joel F. Liebman, John L. Holmes, Rhoda D. Levin, and W. Gary Mallard
LLK - Sharon G. Lias, Rhoda D. Levin, and Sherif A. Kafafi
Ionization energy determinations
IE (eV) | Method | Reference | Comment |
---|---|---|---|
9.23 | EQ | Sieck and Mautner(Meot-Ner), 1982 | LBLHLM |
9.51 ± 0.03 | PE | Rang, Paldoia, et al., 1974 | LLK |

Kovats' RI, non-polar column, isothermal

View large format table.

Column type Active phase Temperature (C) I Reference Comment
CapillarySqualane100.1032.Rang, Orav, et al., 1977Nitrogen or helium; Column length: 100. m; Column diameter: 0.25 mm

Kovats' RI, non-polar column, temperature ramp

View large format table.

Column type Active phase I Reference Comment
CapillaryApiezon L1049.Louis, 1971N2, 1. K/min; Column length: 50. m; Column diameter: 0.25 mm; Tstart: 60. C

Kovats' RI, non-polar column, custom temperature program

View large format table.

Column type Active phase I Reference Comment
CapillaryPetrocol DH-1001023.35Haagen-Smit Laboratory, 1997He; Column length: 100. m; Column diameter: 0.2 mm; Program: 5C(10min) => 5C/min => 50C(48min) => 1.5C/min => 195C(91min)

Kovats' RI, polar column, isothermal

View large format table.

Column type Active phase Temperature (C) I Reference Comment
CapillaryPEG 4000100.1120.Rang, Orav, et al., 1988
CapillaryPEG 400060.1096.Rang, Orav, et al., 1988
CapillaryPEG 400070.1102.Rang, Orav, et al., 1988
CapillaryPEG 400080.1108.Rang, Orav, et al., 1988
CapillaryPEG 4000100.1120.Rang, Orav, et al., 1977Nitrogen or Helium; Column length: 45. m; Column diameter: 0.25 mm

Van Den Dool and Kratz RI, non-polar column, temperature ramp

View large format table.

Column type Active phase I Reference Comment
CapillaryUltra-11014.Olson, Sinkevitch, et al., 19924. K/min; Tstart: -40. C; Tend: 230. C
CapillaryPetrocol DH984.White, Hackett, et al., 1992100. m/0.25 mm/0.5 μm, He, 1. K/min; Tstart: 30. C; Tend: 220. C

Normal alkane RI, non-polar column, temperature ramp

View large format table.

Column type Active phase I Reference Comment
CapillaryPetrocol DH1022.Supelco, 2012100. m/0.25 mm/0.50 μm, Helium, 20. C @ 15. min, 15. K/min, 220. C @ 30. min

Normal alkane RI, non-polar column, custom temperature program

View large format table.

Column type Active phase I Reference Comment
CapillarySqualane1005.Chen, 2008Program: not specified
CapillaryOV-1, SE-30, Methyl silicone, SP-2100, OV-101, DB-1, etc.1019.Waggott and Davies, 1984Hydrogen; Column length: 50. m; Column diameter: 0.32 mm; Program: not specified

References

Weast and Grasselli, 1989
CRC Handbook of Data on Organic Compounds, 2nd Editon, Weast,R.C and Grasselli, J.G., ed(s)., CRC Press, Inc., Boca Raton, FL, 1989, 1. [all data]
Forziati and Rossini, 1949
Forziati, A.F.; Rossini, F.D.,
J. Res. Natl. Bur. Stand. (U. S.), 1949, 43, 473. [all data]
Smith and Pennekamp, 1945
Smith, H.A.; Pennekamp, E.F.H.,
The Catalytic Hydrogenation of the Benzene Nucleus II. The Hydrogenation of Benzene and Mono-alkylkbenzenes,
J. Am. Chem. Soc., 1945, 67, 276. [all data]
Signaigo and Cramer, 1933
Signaigo, F.K.; Cramer, P.L.,
The preparation of some mono- and dialkylcylohexanes,
J. Am. Chem. Soc., 1933, 55, 3326-32. [all data]
Timmermans, 1927
Timmermans, J.,
The Melting Point of Organic Substances,
Bull. Soc. Chim. Belg., 1927, 36, 502. [all data]
Stephenson and Malanowski, 1987
Stephenson, Richard M.; Malanowski, Stanislaw,
Handbook of the Thermodynamics of Organic Compounds, 1987, https://doi.org/10.1007/978-94-009-3173-2
. [all data]
Forziati, Norris, et al., 1949
Forziati, Alphonse F.; Norris, William R.; Rossini, Frederick D.,
Vapor pressures and boiling points of sixty API-NBS hydrocarbons,
J. RES. NATL. BUR. STAN., 1949, 43, 6, 555-17, https://doi.org/10.6028/jres.043.050
. [all data]
Forziati, Norris, et al., 1949, 2
Forziati, A.F.; Norris, W.R.; Rossini, F.D.,
Vapor Pressures and Boiling Points of Sixty API-NBS Hydrocarbons,
J. Res. Natl. Bur. Stand. (U.S.), 1949, 43, 6, 555-563, https://doi.org/10.6028/jres.043.050
. [all data]
Sieck and Mautner(Meot-Ner), 1982
Sieck, L.W.; Mautner(Meot-Ner), M.,
Ionization energies and entropies of cycloalkanes. Kinetics of free energy controlled charge-transfer reactions,
J. Phys. Chem., 1982, 86, 3646. [all data]
Rang, Paldoia, et al., 1974
Rang, S.; Paldoia, P.; Talvari, A.,
Ionization potentials of unsaturated hydrocarbons. 2. Mono-substituted cyclopentenes and cyclohexenes,
Eesti. NSV Tead. Akad. Toim., 1974, 354. [all data]