1-Silacyclo-3-pentene
- Formula: C4H8Si
- Molecular weight: 84.1918
- IUPAC Standard InChIKey: GTACVKZZKKFPSU-UHFFFAOYSA-N
- CAS Registry Number: 7049-25-4
- Chemical structure:
View 3d structure (requires JavaScript / HTML 5) - Other names: Silacyclopent-3-ene

Gas phase ion energetics data

Data compiled by: Sharon G. Lias, Rhoda D. Levin, and Sherif A. Kafafi
Ionization energy determinations
IE (eV) | Method | Reference | Comment |
---|---|---|---|
9.21 | PE | Bertoti, Cradock, et al., 1976 | Vertical value |

References

Bertoti, Cradock, et al., 1976
Bertoti, I.; Cradock, S.; Ebsworth, E.A.V.; Whiteford, R.A.,
Photoelectron spectra and transannular interactions in 1-silacyclopent-3-enes,
J. Chem. Soc. Dalton Trans., 1976, 937. [all data]