Selenium difluoride
- Formula: F2Se
- Molecular weight: 116.96
- IUPAC Standard InChIKey: YFFGQPRBGMOOJR-UHFFFAOYSA-N
- CAS Registry Number: 70421-43-1
- Chemical structure:

Vibrational and/or electronic energy levels

Data compiled by: Marilyn E. Jacox
State: X
Vib. sym. |
No. | Approximate type of mode |
cm-1 | Med. | Method | References | |
---|---|---|---|---|---|---|---|
a1 | 1 | Sym. stretch | 699 | Ar | IR | Haas and Willner, 1979 | |
b2 | 3 | Asym. stretch | 672 | Ar | IR | Haas and Willner, 1979 | |
Additional references: Jacox, 1998, page 208

References

Haas and Willner, 1979
Haas, A.; Willner, H.,
Chalkogenfluoride in niedrigen Oxydationsstufen. III. Die bin«65533»ren Selenfluoride SeF2, FSeSeF und SeSeF2,
Z. Anorg. Allg. Chem., 1979, 454, 1, 17, https://doi.org/10.1002/zaac.19794540104
. [all data]
Jacox, 1998
Jacox, M.E.,
Vibrational and electronic energy levels of polyatomic transient molecules: supplement A,
J. Phys. Chem. Ref. Data, 1998, 27, 2, 115-393, https://doi.org/10.1063/1.556017
. [all data]