(Z)-1,3-Butadien-1-ol
- Formula: C4H6O
- Molecular weight: 70.0898
- IUPAC Standard InChIKey: LNDKRVOOYMEYTC-ARJAWSKDSA-N
- CAS Registry Number: 70415-58-6
- Chemical structure:
View 3d structure (requires JavaScript / HTML 5) - Stereoisomers:
- Other names: CH2=CHCH=CHOH (Z); (Z)-1-Hydroxy-1,3-butadiene; (1Z)-1,3-Butadien-1-ol; (Z)-1,3-Butadienol

Gas phase thermochemistry data

Data compiled by: Hussein Y. Afeefy, Joel F. Liebman, and Stephen E. Stein
Quantity | Value | Units | Method | Reference | Comment |
---|---|---|---|---|---|
ΔfH°gas | -90. ± 9. | kJ/mol | Kin | Turecek, Havlas, et al., 1986 |

Gas phase ion energetics data

Data compiled as indicated in comments:
LBLHLM - Sharon G. Lias, John E. Bartmess, Joel F. Liebman, John L. Holmes, Rhoda D. Levin, and W. Gary Mallard
Ionization energy determinations
IE (eV) | Method | Reference | Comment |
---|---|---|---|
8.47 ± 0.03 | EI | Turecek, Havlas, et al., 1986, 2 | LBLHLM |
8.47 ± 0.03 | EI | Turecek and Havlas, 1986 | LBLHLM |

References

Turecek, Havlas, et al., 1986
Turecek, F.; Havlas, Z.; Maquin, F.; Hill, N.; Gaumann, T.,
(E)- And (Z)-1-hydroxy-1,3-butadiene: new kinetically unstable C4H6O,
J. Org. Chem., 1986, 51, 4061-4065. [all data]
Turecek, Havlas, et al., 1986, 2
Turecek, F.; Havlas, Z.; Maquin, F.; Hill, N.; Gaumann, T.,
(E)- and (Z)-1-hydroxy-1,3-butadiene: New kinetically unstable C4H6O isomers,
J. Org. Chem., 1986, 51, 4061. [all data]
Turecek and Havlas, 1986
Turecek, F.; Havlas, Z.,
Energy barriers to the diels-alder cycloadditions and cycloreversions of cation-radicals in the gas phase,
J. Chem. Soc. Perkin Trans. 2, 1986, 1011. [all data]