2-t-Butylfuran
- Formula: C8H12O
- Molecular weight: 124.1803
- IUPAC Standard InChIKey: BGQBONSBNSNYIO-UHFFFAOYSA-N
- CAS Registry Number: 7040-43-9
- Chemical structure:
View 3d structure (requires JavaScript / HTML 5) - Permanent link for this species. Use this link for bookmarking this species for future reference.

Phase change data

Data compiled as indicated in comments:
BS - Robert L. Brown and Stephen E. Stein
AC - William E. Acree, Jr., James S. Chickos
Quantity | Value | Units | Method | Reference | Comment |
---|---|---|---|---|---|
Tboil | 392.7 | K | N/A | Weast and Grasselli, 1989 | BS |
Quantity | Value | Units | Method | Reference | Comment |
ΔvapH° | 38.1 ± 0.4 | kJ/mol | GS | Verevkin and Welle, 1998 | Based on data from 270. to 308. K.; AC |
Enthalpy of vaporization
ΔvapH (kJ/mol) | Temperature (K) | Method | Reference | Comment |
---|---|---|---|---|
38.7 ± 0.4 | 289. | GS | Verevkin and Welle, 1998 | Based on data from 270. to 308. K.; AC |

Gas phase ion energetics data

Data compiled as indicated in comments:
LBLHLM - Sharon G. Lias, John E. Bartmess, Joel F. Liebman, John L. Holmes, Rhoda D. Levin, and W. Gary Mallard
LLK - Sharon G. Lias, Rhoda D. Levin, and Sherif A. Kafafi
Ionization energy determinations
IE (eV) | Method | Reference | Comment |
---|---|---|---|
8.1 | PE | Veszpremi, Nyulaszi, et al., 1987 | LBLHLM |
8.38 | PE | Zykov, Erchak, et al., 1983 | LBLHLM |
8.32 | CTS | Aloisi, Santini, et al., 1975 | LLK |
8.19 | PE | Veszpremi, Nyulaszi, et al., 1987 | Vertical value; LBLHLM |

References

Weast and Grasselli, 1989
CRC Handbook of Data on Organic Compounds, 2nd Editon, Weast,R.C and Grasselli, J.G., ed(s)., CRC Press, Inc., Boca Raton, FL, 1989, 1. [all data]
Verevkin and Welle, 1998
Verevkin, Sergey P.; Welle, Frank M.,
Structural Chemistry, 1998, 9, 3, 215-221, https://doi.org/10.1023/A:1022475115296
. [all data]
Veszpremi, Nyulaszi, et al., 1987
Veszpremi, T.; Nyulaszi, L.; Nagy, J.,
Ultraviolet photoelectron spectroscopy and quantum-mechanical study of alkyl- and trimethylsilyl-furanes,
J. Organomet. Chem., 1987, 331, 175. [all data]
Zykov, Erchak, et al., 1983
Zykov, B.G.; Erchak, N.P.; Khvostenko, V.I.; Lukevits, E.; Matorykina, V.F.; Asfandiarov, N.L.,
Photoelectron spectra of furylsilanes and their carbon analogs,
J. Organomet. Chem., 1983, 253, 301. [all data]
Aloisi, Santini, et al., 1975
Aloisi, G.; Santini, S.; Savelli, G.,
Molecular complexes of heteroaromatic five membered ring compounds with tetracyanoethylene. Charge transfer spectra, equilibrium constants and ionization potentials of the donors,
J. Chem. Soc. Faraday Trans. 1, 1975, 70, 2045. [all data]