diethyl sulphoxide
- Formula: C4H10OS
- Molecular weight: 106.187
- IUPAC Standard InChIKey: CCAFPWNGIUBUSD-UHFFFAOYSA-N
- CAS Registry Number: 70-29-1
- Chemical structure:
View 3d structure (requires JavaScript / HTML 5) - Other names: Diethyl sulfoxide

Gas phase thermochemistry data

Data compiled by: Hussein Y. Afeefy, Joel F. Liebman, and Stephen E. Stein
Quantity | Value | Units | Method | Reference | Comment |
---|---|---|---|---|---|
ΔfH°gas | -205. ± 2. | kJ/mol | Ccr | Mackle and O'Hare, 1961 |

Condensed phase thermochemistry data

Data compiled by: Hussein Y. Afeefy, Joel F. Liebman, and Stephen E. Stein
Quantity | Value | Units | Method | Reference | Comment |
---|---|---|---|---|---|
ΔfH°liquid | -267.6 ± 0.8 | kJ/mol | Ccr | Mackle and O'Hare, 1961 | |
Quantity | Value | Units | Method | Reference | Comment |
ΔcH°liquid | -3337.5 ± 0.4 | kJ/mol | Ccr | Mackle and O'Hare, 1961 |

Phase change data

Data compiled as indicated in comments:
TRC - Thermodynamics Research Center, NIST Boulder Laboratories, Chris Muzny director
ALS - Hussein Y. Afeefy, Joel F. Liebman, and Stephen E. Stein
AC - William E. Acree, Jr., James S. Chickos
Quantity | Value | Units | Method | Reference | Comment |
---|---|---|---|---|---|
Tboil | 484. | K | N/A | Mackle and O'Hare, 1961, 2 | Uncertainty assigned by TRC = 1. K; TRC |
Quantity | Value | Units | Method | Reference | Comment |
ΔvapH° | 62. ± 1. | kJ/mol | V | Mackle and O'Hare, 1961 | ALS |
Enthalpy of vaporization
ΔvapH (kJ/mol) | Temperature (K) | Reference | Comment |
---|---|---|---|
58.7 ± 3.3 | 308. | Markarian, Zatikyan, et al., 2005 | Based on data from 298. to 318. K.; AC |

Gas phase ion energetics data

Data evaluated as indicated in comments:
L - Sharon G. Lias
Data compiled as indicated in comments:
LLK - Sharon G. Lias, Rhoda D. Levin, and Sherif A. Kafafi
Quantity | Value | Units | Method | Reference | Comment |
---|---|---|---|---|---|
IE (evaluated) | 8.75 | eV | N/A | N/A | L |
Ionization energy determinations
IE (eV) | Method | Reference | Comment |
---|---|---|---|
8.75 ± 0.03 | EI | Potzinger, Stracke, et al., 1975 | LLK |
8.76 | PE | Bock and Solouki, 1974 | Vertical value; LLK |
8.76 | PE | Bock and Solouki, 1972 | Vertical value; LLK |
Appearance energy determinations
Ion | AE (eV) | Other Products | Method | Reference | Comment |
---|---|---|---|---|---|
CH3OS+ | 12.04 ± 0.08 | C2H4+CH3 | EI | Potzinger, Stracke, et al., 1975 | LLK |
C2H5+ | 11.9 ± 0.2 | C2H5SO | EI | Potzinger, Stracke, et al., 1975 | LLK |
C2H6OS+ | 9.86 ± 0.08 | C2H4 | EI | Potzinger, Stracke, et al., 1975 | LLK |

References

Mackle and O'Hare, 1961
Mackle, H.; O'Hare, P.A.G.,
Studies in the thermochemistry of sulphoxides. Part 1 - The gas-phase heats of formation of diethyl, di-n-propyl, t-butyl ethyl, allyl ethyl and diphenyl sulphoxides,
Trans. Faraday Soc., 1961, 57, 2219-2224. [all data]
Mackle and O'Hare, 1961, 2
Mackle, H.; O'Hare, P.A.G.,
Studies in the thermochemistry of sulphoxides. Part 1.- The gas-phase heats of formation of diethyl, di-n-propyl, t-butyl ethyl, allyl ethyl and diphenyl sulphoxides,
Trans. Faraday Soc., 1961, 57, 2119. [all data]
Markarian, Zatikyan, et al., 2005
Markarian, Shiraz A.; Zatikyan, Ashkhen L.; Grigoryan, Vazganush V.; Grigoryan, Gevorg S.,
Vapor Pressures of Pure Diethyl Sulfoxide from (298.15 to 318.15) K and Vapor-Liquid Equilibria of Binary Mixtures of Diethyl Sulfoxide with Water,
J. Chem. Eng. Data, 2005, 50, 1, 23-25, https://doi.org/10.1021/je034278t
. [all data]
Potzinger, Stracke, et al., 1975
Potzinger, P.; Stracke, H.-U.; Kupper, W.; Gollnick, K.,
Ionisierungs- und Auftrittspotentialmessungen an Dialkylsulfoxiden,
Z. Naturforsch. A:, 1975, 30, 340. [all data]
Bock and Solouki, 1974
Bock, H.; Solouki, B.,
Photoelektronenspektren und molekuleigenschaften, XXXV. Sulfoxide X2SO - beispiele fur den nutzen von korrelations - diagrammen bei der diskussion von substituenteneffekten und von geometrischen storungen,
Chem. Ber., 1974, 107, 2299. [all data]
Bock and Solouki, 1972
Bock, H.; Solouki, B.,
The sulfoxide bond,
Angew. Chem. Int. Ed. Engl., 1972, 11, 436. [all data]