Phenylalanine-N-carboxylic acid dimethyl ester
- Formula: C12H15NO4
- Molecular weight: 237.2518
- IUPAC Standard InChIKey: JIHFRPSFLTXYEP-UHFFFAOYSA-N
- CAS Registry Number: 70288-75-4
- Chemical structure:

Condensed phase thermochemistry data

Data compiled by: Hussein Y. Afeefy, Joel F. Liebman, and Stephen E. Stein
Quantity | Value | Units | Method | Reference | Comment |
---|---|---|---|---|---|
ΔfH°solid | -183.2 ± 1.4 | kcal/mol | Ccb | Breitenbach, Derkosch, et al., 1952 | Reanalyzed by Cox and Pilcher, 1970, Original value = -182.8 kcal/mol |
Quantity | Value | Units | Method | Reference | Comment |
ΔcH°solid | -1457.8 ± 1.4 | kcal/mol | Ccb | Breitenbach, Derkosch, et al., 1952 | Reanalyzed by Cox and Pilcher, 1970, Original value = -1457.9 kcal/mol |

References

Breitenbach, Derkosch, et al., 1952
Breitenbach, J.W.; Derkosch, J.; Wessely, F.,
Energetik der bildung hochmolekularer polypeptide,
Monatsh. Chem., 1952, 83, 591. [all data]
Cox and Pilcher, 1970
Cox, J.D.; Pilcher, G.,
Thermochemistry of Organic and Organometallic Compounds, Academic Press, New York, 1970, 1-636. [all data]