Adamantane, 1,3-dimethyl-
- Formula: C12H20
- Molecular weight: 164.2872
- IUPAC Standard InChIKey: CWNOIUTVJRWADX-UHFFFAOYSA-N
- CAS Registry Number: 702-79-4
- Chemical structure:
View 3d structure (requires JavaScript / HTML 5) - Other names: Tricyclo[3.3.1.1(3,7)]decane, 1,3-dimethyl-; 1,3-Dimethyladamantane; 1,3-dimethyltricyclo[3.3.1.13,7]decane

Condensed phase thermochemistry data

Data compiled by: Hussein Y. Afeefy, Joel F. Liebman, and Stephen E. Stein
Quantity | Value | Units | Method | Reference | Comment |
---|---|---|---|---|---|
ΔfH°solid | -68.5 ± 0.6 | kcal/mol | Ccb | Steele and Watt, 1977 | |
Quantity | Value | Units | Method | Reference | Comment |
ΔcH°solid | -1743.3 ± 0.6 | kcal/mol | Ccb | Steele and Watt, 1977 | Corresponding ΔfHºsolid = -68.5 kcal/mol (simple calculation by NIST; no Washburn corrections) |

Phase change data

Data compiled as indicated in comments:
TRC - Thermodynamics Research Center, NIST Boulder Laboratories, Chris Muzny director
AC - William E. Acree, Jr., James S. Chickos
ALS - Hussein Y. Afeefy, Joel F. Liebman, and Stephen E. Stein
DRB - Donald R. Burgess, Jr.
CAL - James S. Chickos, William E. Acree, Jr., Joel F. Liebman, Students of Chem 202 (Introduction to the Literature of Chemistry), University of Missouri -- St. Louis
Quantity | Value | Units | Method | Reference | Comment |
---|---|---|---|---|---|
Tboil | 471. | K | N/A | Anonymous, 1969 | Uncertainty assigned by TRC = 4. K; TRC |
Quantity | Value | Units | Method | Reference | Comment |
Tfus | 245.0 | K | N/A | Clark, Knox, et al., 1977 | Crystal phase 1 phase; Uncertainty assigned by TRC = 0.5 K; TRC |
Quantity | Value | Units | Method | Reference | Comment |
Tc | 708. | K | N/A | Steele, Chirico, et al., 1996 | Uncertainty assigned by TRC = 2. K; TRC |
Quantity | Value | Units | Method | Reference | Comment |
Pc | 29.61 | atm | N/A | Steele, Chirico, et al., 1996 | Uncertainty assigned by TRC = 2.47 atm; from extraploation of obs. vapor pressures to Tc; TRC |
Quantity | Value | Units | Method | Reference | Comment |
ρc | 1.750 | mol/l | N/A | Steele, Chirico, et al., 1996 | Uncertainty assigned by TRC = 0.073 mol/l; TRC |
Quantity | Value | Units | Method | Reference | Comment |
ΔvapH° | 11.9 ± 0.05 | kcal/mol | C | Varushchenko, Pashchenko, et al., 2001 | AC |
ΔvapH° | 11.8 ± 0.07 | kcal/mol | EB | Steele, Chirico, et al., 1996, 2 | Based on data from 352. to 526. K.; AC |
Quantity | Value | Units | Method | Reference | Comment |
ΔsubH° | 16.2 ± 0.3 | kcal/mol | V | Steele and Watt, 1977 | ALS |
ΔsubH° | 16.3 | kcal/mol | N/A | Steele and Watt, 1977 | DRB |
ΔsubH° | 16.2 ± 0.31 | kcal/mol | EB | Steele and Watt, 1977 | AC |
Enthalpy of vaporization
ΔvapH (kcal/mol) | Temperature (K) | Method | Reference | Comment |
---|---|---|---|---|
11.8 ± 0.05 | 308. | C | Varushchenko, Pashchenko, et al., 2001 | AC |
11.0 ± 0.07 | 360. | EB | Steele, Chirico, et al., 1996, 2 | Based on data from 352. to 526. K.; AC |
10.4 ± 0.07 | 400. | EB | Steele, Chirico, et al., 1996, 2 | Based on data from 352. to 526. K.; AC |
9.92 ± 0.07 | 440. | EB | Steele, Chirico, et al., 1996, 2 | Based on data from 352. to 526. K.; AC |
9.35 ± 0.07 | 480. | EB | Steele, Chirico, et al., 1996, 2 | Based on data from 352. to 526. K.; AC |
8.70 ± 0.07 | 520. | EB | Steele, Chirico, et al., 1996, 2 | Based on data from 352. to 526. K.; AC |
Enthalpy of fusion
ΔfusH (kcal/mol) | Temperature (K) | Method | Reference | Comment |
---|---|---|---|---|
0.368 | 247.8 | AC | Varushchenko, Druzhinina, et al., 2005 | Based on data from 8. to 373. K.; AC |
0.22 | 244. | DSC | Arntz and Schneider, 1980 | AC |
0.22 | 245. | N/A | Clark, Knox, et al., 1977 | AC |
Entropy of fusion
ΔfusS (cal/mol*K) | Temperature (K) | Reference | Comment |
---|---|---|---|
7.96 | 221. | Clark, Knox, et al., 1977 | CAL |
0.899 | 245. |

Gas phase ion energetics data

Data compiled as indicated in comments:
LLK - Sharon G. Lias, Rhoda D. Levin, and Sherif A. Kafafi
Ionization energy determinations
IE (eV) | Method | Reference | Comment |
---|---|---|---|
9.15 | PE | Bewick, Edwards, et al., 1976 | LLK |

Gas phase thermochemistry data

Data compiled by: Hussein Y. Afeefy, Joel F. Liebman, and Stephen E. Stein

Quantity Value Units Method Reference Comment
Δfgas-219. ± 3.kJ/molCcbSteele and Watt, 1977

References

Steele and Watt, 1977
Steele, W.V.; Watt, I.,
The standard enthalpies of formation of adamantanoid compounds 4. Methyladamantanes,
J. Chem. Thermodyn., 1977, 9, 843-849. [all data]
Anonymous, 1969
Anonymous, R.,
Freon Fluorocarbons - properties and applications, E. I. Du Pont, Freon Product Information, B-2, 1969. [all data]
Clark, Knox, et al., 1977
Clark, Timothy; Knox, Trevor Mc.O.; Mackle, Henry; McKervey, M. Anthony,
Order--disorder transitions in substituted adamantanes,
J. Chem. Soc., Faraday Trans. 1, 1977, 73, 0, 1224, https://doi.org/10.1039/f19777301224
. [all data]
Steele, Chirico, et al., 1996
Steele, W.V.; Chirico, R.D.; Knipmeyer, S.E.; Nguyen, A.,
Vapor pressure of acetophenone, (+-)-1,2-butanediol, (+-)-1,3-butanediol, diethylene glycol monopropyl ether, 1,3-dimethyladamantane, 2-ethoxyethyl acetate, ethyl octyl sufide, and pentyl acetate,
J. Chem. Eng. Data, 1996, 41, 1255-68. [all data]
Varushchenko, Pashchenko, et al., 2001
Varushchenko, R.M.; Pashchenko, L.L.; Druzhinina, A.I.; Abramenkov, A.V.; Pimersin, A.A.,
Thermodynamics of vaporization of some alkyladamantanes,
The Journal of Chemical Thermodynamics, 2001, 33, 7, 733-744, https://doi.org/10.1006/jcht.2000.0773
. [all data]
Steele, Chirico, et al., 1996, 2
Steele, W.V.; Chirico, R.D.; Knipmeyer, S.E.; Nguyen, A.,
Vapor Pressure of Acetophenone, (±)-1,2-Butanediol, (±)-1,3-Butanediol, Diethylene Glycol Monopropyl Ether, 1,3-Dimethyladamantane, 2-Ethoxyethyl Acetate, Ethyl Octyl Sulfide, and Pentyl Acetate,
J. Chem. Eng. Data, 1996, 41, 6, 1255-1268, https://doi.org/10.1021/je9601117
. [all data]
Varushchenko, Druzhinina, et al., 2005
Varushchenko, R.M.; Druzhinina, A.I.; Senyavin, V.M.; Sarkisova, V.S.,
The low-temperature heat capacities, phase transitions and thermodynamic properties of 1,3-dimethyladamantane and 1-ethyladamantane,
The Journal of Chemical Thermodynamics, 2005, 37, 2, 141-151, https://doi.org/10.1016/j.jct.2004.06.009
. [all data]
Arntz and Schneider, 1980
Arntz, Horst; Schneider, Gerhard M.,
Calorimetric investigations of plastic crystals at low temperatures and high pressures with differential scanning calorimetry,
Faraday Discuss. Chem. Soc., 1980, 69, 139, https://doi.org/10.1039/dc9806900139
. [all data]
Bewick, Edwards, et al., 1976
Bewick, A.; Edwards, C.J.; Jones, S.R.; Mellor, J.M.,
The electrochemical difunctionalisation of saturated hydrocarbons,
Tetrahedron Lett., 1976, 631. [all data]