Methyl 4-nitrophenyl sulphide
- Formula: C7H7NO2S
- Molecular weight: 169.201
- IUPAC Standard InChIKey: NEZGPRYOJVPJKL-UHFFFAOYSA-N
- CAS Registry Number: 701-57-5
- Chemical structure:
View 3d structure (requires JavaScript / HTML 5) - Other names: 4-Nitrothioanisole; Benzene, 1-(methylthio)-4-nitro-

Gas phase ion energetics data

Data compiled by: Sharon G. Lias, Rhoda D. Levin, and Sherif A. Kafafi
Ionization energy determinations
IE (eV) | Method | Reference | Comment |
---|---|---|---|
8.59 ± 0.01 | PE | Bernardi, Distefano, et al., 1975 | Vertical value |

References

Bernardi, Distefano, et al., 1975
Bernardi, F.; Distefano, G.; Mangini, A.; Pignataro, S.; Spunta, G.,
Photoelectron spectra of substituted anisoles thioanisoles,
J. Electron Spectrosc. Relat. Phenom., 1975, 7, 457. [all data]