Benzenamine, 4-methoxy-N,N-dimethyl-
- Formula: C9H13NO
- Molecular weight: 151.2056
- IUPAC Standard InChIKey: ZTKDMNHEQMILPE-UHFFFAOYSA-N
- CAS Registry Number: 701-56-4
- Chemical structure:
View 3d structure (requires JavaScript / HTML 5) - Other names: 4-Aminophenol, N,N,o-trimethyl-; 4-Methoxy-N,N-dimethylaniline

Reaction thermochemistry data

Data compiled by: Hussein Y. Afeefy, Joel F. Liebman, and Stephen E. Stein
Individual Reactions
By formula: C8H11NO = 0.5C7H9NO + 0.5C9H13NO
Quantity | Value | Units | Method | Reference | Comment |
---|---|---|---|---|---|
ΔrH° | 0.4 | kJ/mol | Eqk | Matvienko, Kachurin, et al., 1982 | liquid phase; Methanesulfonic acid |

Gas phase ion energetics data

Data evaluated as indicated in comments:
HL - Edward P. Hunter and Sharon G. Lias
Data compiled as indicated in comments:
LLK - Sharon G. Lias, Rhoda D. Levin, and Sherif A. Kafafi
Quantity | Value | Units | Method | Reference | Comment |
---|---|---|---|---|---|
Proton affinity (review) | 949.1 | kJ/mol | N/A | Hunter and Lias, 1998 | HL |
Quantity | Value | Units | Method | Reference | Comment |
Gas basicity | 922.4 | kJ/mol | N/A | Hunter and Lias, 1998 | HL |
Ionization energy determinations
IE (eV) | Method | Reference | Comment |
---|---|---|---|
6.7 ± 0.1 | PE | Egdell, Green, et al., 1975 | LLK |
≤6.75 ± 0.02 | PI | Nakato, Ozaki, et al., 1971 | LLK |
7.18 ± 0.01 | PE | Bernardi, Distefano, et al., 1975 | Vertical value; LLK |

Van Den Dool and Kratz RI, non-polar column, custom temperature program

Column type | Active phase | I | Reference | Comment |
---|---|---|---|---|
Capillary | VF-5MS | 1332.8 | Tret'yakov, 2007 | 30. m/0.25 mm/0.25 μm, He; Program: Multi-step temperature program; T(initial)=60C; T(final)=270C |

References

Matvienko, Kachurin, et al., 1982
Matvienko, N.M.; Kachurin, O.I.; Chekhuta, V.G.,
Kinetics and equilibrium of the transalkylation reaction of N-methylarylamines,
Russ. Chem. Rev., 1982, 48, 42-45. [all data]
Hunter and Lias, 1998
Hunter, E.P.; Lias, S.G.,
Evaluated Gas Phase Basicities and Proton Affinities of Molecules: An Update,
J. Phys. Chem. Ref. Data, 1998, 27, 3, 413-656, https://doi.org/10.1063/1.556018
. [all data]
Egdell, Green, et al., 1975
Egdell, R.; Green, J.C.; Rao, C.N.R.,
Photoelectron spectra of substituted benzenes,
Chem. Phys. Lett., 1975, 33, 600. [all data]
Nakato, Ozaki, et al., 1971
Nakato, Y.; Ozaki, M.; Egawa, A.; Tsubornura, H.,
Organic amino compounds with very low ionization potentials,
Chem. Phys. Lett., 1971, 9, 615. [all data]
Bernardi, Distefano, et al., 1975
Bernardi, F.; Distefano, G.; Mangini, A.; Pignataro, S.; Spunta, G.,
Photoelectron spectra of substituted anisoles thioanisoles,
J. Electron Spectrosc. Relat. Phenom., 1975, 7, 457. [all data]