4-Tert-butylfluorobenzene
- Formula: C10H13F
- Molecular weight: 152.2086
- IUPAC Standard InChIKey: ISXPXFQBHNIYCU-UHFFFAOYSA-N
- CAS Registry Number: 701-30-4
- Chemical structure:
View 3d structure (requires JavaScript / HTML 5) - Permanent link for this species. Use this link for bookmarking this species for future reference.

Gas phase ion energetics data

Data compiled as indicated in comments:
LBLHLM - Sharon G. Lias, John E. Bartmess, Joel F. Liebman, John L. Holmes, Rhoda D. Levin, and W. Gary Mallard
Ionization energy determinations
IE (eV) | Method | Reference | Comment |
---|---|---|---|
8.59 ± 0.02 | EI | Orlov, Misharev, et al., 1986 | LBLHLM |
Appearance energy determinations
Ion | AE (eV) | Other Products | Method | Reference | Comment |
---|---|---|---|---|---|
C9H10F+ | 9.6 ± 0.1 | CH3 | EI | Orlov, Misharev, et al., 1986 | LBLHLM |

References

Orlov, Misharev, et al., 1986
Orlov, V.; Misharev, A.; Takhistox, V.,
Determination of the enthalpy of formation of para-substituted α,α-dimethyl cations in the gas phase,
Izv. Akad. Nauk SSSR Ser. Khim., 1986, 9, 2006. [all data]