Benzenamine, 2-methoxy-N,N-dimethyl-
- Formula: C9H13NO
- Molecular weight: 151.2056
- IUPAC Standard InChIKey: XQFJDFIHJKPUEL-UHFFFAOYSA-N
- CAS Registry Number: 700-75-4
- Chemical structure:
View 3d structure (requires JavaScript / HTML 5) - Other names: Benzene, 1-methoxy-2-dimethylamino-; Benzene, 1-dimethylamino-2-methoxy-; 2-Methoxy-N,N-dimethylaniline

Gas phase ion energetics data

Data compiled by: Sharon G. Lias, Rhoda D. Levin, and Sherif A. Kafafi
Ionization energy determinations
IE (eV) | Method | Reference |
---|---|---|
7.59 ± 0.02 | EI | Hvistendahl and Undheim, 1972 |

Van Den Dool and Kratz RI, non-polar column, temperature ramp

Column type | Active phase | I | Reference | Comment |
---|---|---|---|---|
Capillary | VF-5MS | 1213. | Todua, 2011 | 30. m/0.25 mm/0.25 μm, He; Tstart: 60. C; Tend: 270. C |

References

Hvistendahl and Undheim, 1972
Hvistendahl, G.; Undheim, K.,
Mass spectrometry of onium compounds. IX: on the evaporation of anilinium oxides. Ionization potential measurements,
Org. Mass Spectrom., 1972, 6, 217. [all data]
Todua, 2011
Todua, N.G.,
Retention Data. NIST Mass Spectrometry Data Center., NIST Mass Spectrometry Data Center, 2011. [all data]