2-Adamantanone
- Formula: C10H14O
- Molecular weight: 150.2176
- IUPAC Standard InChIKey: IYKFYARMMIESOX-UHFFFAOYSA-N
- CAS Registry Number: 700-58-3
- Chemical structure:
View 3d structure (requires JavaScript / HTML 5) - Other names: Tricyclo[3.3.1.1(3,7)]decanone; Adamantanone; 2-Adamantone; 2-Oxoadamantane; Adamantan-2-one; tricyclo[3.3.1.13,7]decan-2-one

Gas phase thermochemistry data

Data compiled by: Hussein Y. Afeefy, Joel F. Liebman, and Stephen E. Stein
Quantity | Value | Units | Method | Reference | Comment |
---|---|---|---|---|---|
ΔfH°gas | -231. ± 4.6 | kJ/mol | Ccb | Arora and Steele, 1978 |

Condensed phase thermochemistry data

Data compiled by: Hussein Y. Afeefy, Joel F. Liebman, and Stephen E. Stein
Quantity | Value | Units | Method | Reference | Comment |
---|---|---|---|---|---|
ΔfH°solid | -311. ± 4. | kJ/mol | Ccb | Arora and Steele, 1978 | |
Quantity | Value | Units | Method | Reference | Comment |
ΔcH°solid | -5625. ± 4. | kJ/mol | Ccb | Arora and Steele, 1978 | Corresponding ΔfHºsolid = -311. kJ/mol (simple calculation by NIST; no Washburn corrections) |

Phase change data

Data compiled as indicated in comments:
AC - William E. Acree, Jr., James S. Chickos
ALS - Hussein Y. Afeefy, Joel F. Liebman, and Stephen E. Stein
Quantity | Value | Units | Method | Reference | Comment |
---|---|---|---|---|---|
ΔvapH° | 60.7 ± 0.2 | kJ/mol | GC | van Roon, Parsons, et al., 2002 | AC |
Quantity | Value | Units | Method | Reference | Comment |
ΔsubH° | 66.4 ± 0.3 | kJ/mol | C | Bazyleva, Blokhin, et al., 2006 | AC |
ΔsubH° | 66.3 ± 0.8 | kJ/mol | ME | Bazyleva, Blokhin, et al., 2006 | Based on data from 280. to 333. K.; AC |
ΔsubH° | 76.1 ± 1.5 | kJ/mol | N/A | Miroshnichenko, Lebedev, et al., 2002 | See also Bazyleva, Blokhin, et al., 2006.; AC |
ΔsubH° | 80. ± 3. | kJ/mol | V | Arora and Steele, 1978 | ALS |
ΔsubH° | 80.3 ± 2.5 | kJ/mol | BG | Arora and Steele, 1978 | AC |
Enthalpy of fusion
ΔfusH (kJ/mol) | Temperature (K) | Method | Reference | Comment |
---|---|---|---|---|
11.77 | 557.5 | DSC | Bazyleva, Blokhin, et al., 2006 | AC |

Gas phase ion energetics data

Data compiled as indicated in comments:
LLK - Sharon G. Lias, Rhoda D. Levin, and Sherif A. Kafafi
RDSH - Henry M. Rosenstock, Keith Draxl, Bruce W. Steiner, and John T. Herron
Ionization energy determinations
IE (eV) | Method | Reference | Comment |
---|---|---|---|
8.62 | PE | Kovac and Klasinc, 1978 | LLK |
8.59 | PE | Worley, Mateescu, et al., 1973 | LLK |
8.76 | PE | Bodor, Dewar, et al., 1970 | RDSH |
8.67 | PE | Kovac and Klasinc, 1978 | Vertical value; LLK |
8.80 ± 0.02 | PE | Worrell, Verhoeven, et al., 1974 | Vertical value; LLK |

Kovats' RI, polar column, isothermal

Data compiled by: NIST Mass Spectrometry Data Center, William E. Wallace, director

Column type CapillaryCapillaryCapillary
Active phase Carbowax 20MCarbowax 20MCarbowax 20M
Column length (m) 50.50.50.
Carrier gas N2N2N2
Substrate
Column diameter (mm) 0.270.270.27
Phase thickness (μm)
Temperature (C) 145.160.175.
I 1867.1895.1918.
ReferenceBurkhard, Vais, et al., 1969Burkhard, Vais, et al., 1969Burkhard, Vais, et al., 1969
Comment MSDC-RI MSDC-RI MSDC-RI

Kovats' RI, non-polar column, isothermal

Data compiled by: NIST Mass Spectrometry Data Center, William E. Wallace, director

Column type CapillaryCapillaryCapillaryCapillaryCapillary
Active phase OV-101SE-30SE-30SE-30SE-30
Column length (m) 50.50.50.50.50.
Carrier gas N2N2N2N2N2
Substrate
Column diameter (mm) 0.250.270.270.270.27
Phase thickness (μm)
Temperature (C) 200.145.160.175.190.
I 1360.1320.1344.1357.1370.
ReferenceSuslov, Rudenko, et al., 1988Burkhard, Vais, et al., 1969Burkhard, Vais, et al., 1969Burkhard, Vais, et al., 1969Burkhard, Vais, et al., 1969
Comment MSDC-RI MSDC-RI MSDC-RI MSDC-RI MSDC-RI

Normal alkane RI, non-polar column, custom temperature program

Data compiled by: NIST Mass Spectrometry Data Center, William E. Wallace, director

Column type CapillaryCapillary
Active phase Polydimethyl siloxanePolydimethyl siloxane
Column length (m)
Carrier gas
Substrate
Column diameter (mm)
Phase thickness (μm)
Program not specifiednot specified
I 1320.1320.
ReferenceBayat and Abad, 2011Bayat and Abad M.F.Y., 2011
Comment MSDC-RI MSDC-RI

References

Arora and Steele, 1978
Arora, M.; Steele, W.V.,
The standard enthalpies of formation of adamantanoid compounds 5. Adamantanols and adamantanone,
J. Chem. Thermodyn., 1978, 10, 403-407. [all data]
van Roon, Parsons, et al., 2002
van Roon, André; Parsons, John R.; Govers, Harrie A.J.,
Gas chromatographic determination of vapour pressure and related thermodynamic properties of monoterpenes and biogenically related compounds,
Journal of Chromatography A, 2002, 955, 1, 105-115, https://doi.org/10.1016/S0021-9673(02)00200-5
. [all data]
Bazyleva, Blokhin, et al., 2006
Bazyleva, Ala B.; Blokhin, Andrey V.; Kabo, Gennady J.; Kabo, Andrey G.; Sevruk, Viktor M.,
Thermodynamic properties of 2-adamantanone in the condensed and ideal gaseous states,
Thermochimica Acta, 2006, 451, 1-2, 65-72, https://doi.org/10.1016/j.tca.2006.08.018
. [all data]
Miroshnichenko, Lebedev, et al., 2002
Miroshnichenko, E.A.; Lebedev, V.P.; Matyushin, Yu.N.,
Doklady Physical Chemistry, 2002, 382, 4/6, 40-42, https://doi.org/10.1023/A:1014499229527
. [all data]
Kovac and Klasinc, 1978
Kovac, B.; Klasinc, L.,
Photoelectron spectroscopy of adamantane and some adamantanones,
Croat. Chem. Acta, 1978, 51, 55. [all data]
Worley, Mateescu, et al., 1973
Worley, S.D.; Mateescu, G.D.; McFarland, C.W.; Fort, R.C., Jr.; Sheley, C.F.,
Photoelectron spectra and MINDO-SCF-MO calculations for adamantane and some of its derivatives,
J. Am. Chem. Soc., 1973, 95, 7580. [all data]
Bodor, Dewar, et al., 1970
Bodor, N.; Dewar, M.J.S.; Worley, S.D.,
Photoelectron spectra of molecules. III. Ionization potentials of some cyclic hydrocarbons and their derivatives, and heats of formation and ionization potentials calculated by the MINDO SCF MO method,
J. Am. Chem. Soc., 1970, 92, 19. [all data]
Worrell, Verhoeven, et al., 1974
Worrell, C.; Verhoeven, J.W.; Speckamp, W.N.,
Through-bond interaction in 1-aza-adamantane derivatives,
Tetrahedron, 1974, 30, 3525. [all data]