4-Hepten-2-yne, 5-ethyl-
- Formula: C9H14
- Molecular weight: 122.2075
- IUPAC Standard InChIKey: OJSHYJAEMZITND-UHFFFAOYSA-N
- CAS Registry Number: 70058-01-4
- Chemical structure:
View 3d structure (requires JavaScript / HTML 5) - Permanent link for this species. Use this link for bookmarking this species for future reference.

Gas phase ion energetics data

Data compiled by: Sharon G. Lias, Rhoda D. Levin, and Sherif A. Kafafi
Ionization energy determinations
IE (eV) | Method | Reference |
---|---|---|
8.12 ± 0.01 | PE | Carlier, Mouvier, et al., 1979 |

References

Carlier, Mouvier, et al., 1979
Carlier, P.; Mouvier, G.; Mesnard, D.; Miginiac, L.,
Etude par spectrometrie de photoelectrons de la structure electronique des phenyl-alcynes conjugues,
J. Electron Spectrosc. Relat. Phenom., 1979, 16, 147. [all data]