2-Methyl-1-nonene-3-yne
- Formula: C10H16
- Molecular weight: 136.2340
- IUPAC Standard InChIKey: GSFPEKGMYODGNK-UHFFFAOYSA-N
- CAS Registry Number: 70058-00-3
- Chemical structure:
View 3d structure (requires JavaScript / HTML 5) - Other names: 2-Methyl-1-nonen-3-yne; 1-Nonen-3-yne, 2-methyl-

Gas phase ion energetics data

Data compiled by: Sharon G. Lias, Rhoda D. Levin, and Sherif A. Kafafi
Ionization energy determinations
IE (eV) | Method | Reference |
---|---|---|
8.57 ± 0.01 | PE | Carlier, Mouvier, et al., 1979 |

References

Carlier, Mouvier, et al., 1979
Carlier, P.; Mouvier, G.; Mesnard, D.; Miginiac, L.,
Etude par spectrometrie de photoelectrons de la structure electronique des phenyl-alcynes conjugues,
J. Electron Spectrosc. Relat. Phenom., 1979, 16, 147. [all data]