Adamantan-2-ol
- Formula: C10H16O
- Molecular weight: 152.2334
- IUPAC Standard InChIKey: FOWDOWQYRZXQDP-UHFFFAOYSA-N
- CAS Registry Number: 700-57-2
- Chemical structure:
View 3d structure (requires JavaScript / HTML 5) - Other names: Tricyclo[3.3.1.13,7]decan-2-ol; 2-Adamantanol; 2-Hydroxyadamantane; tricyclo[3.3.1.13,7]decan-2-ol

Gas phase ion energetics data

Data compiled as indicated in comments:
LLK - Sharon G. Lias, Rhoda D. Levin, and Sherif A. Kafafi
RDSH - Henry M. Rosenstock, Keith Draxl, Bruce W. Steiner, and John T. Herron
Ionization energy determinations
IE (eV) | Method | Reference | Comment |
---|---|---|---|
9.09 ± 0.07 | PE | Worley, Mateescu, et al., 1973 | LLK |
9.25 | PE | Bodor, Dewar, et al., 1970 | RDSH |

Normal alkane RI, non-polar column, custom temperature program

Data compiled by: NIST Mass Spectrometry Data Center, William E. Wallace, director

Column type CapillaryCapillary
Active phase Polydimethyl siloxaneApiezon L
Column length (m)
Carrier gas
Substrate
Column diameter (mm)
Phase thickness (μm)
Program not specifiednot specified
I 1329.1405.
ReferenceBayat and Abad, 2011Kurbatova, Kolosova, et al., 2000
Comment MSDC-RI MSDC-RI

References

Worley, Mateescu, et al., 1973
Worley, S.D.; Mateescu, G.D.; McFarland, C.W.; Fort, R.C., Jr.; Sheley, C.F.,
Photoelectron spectra and MINDO-SCF-MO calculations for adamantane and some of its derivatives,
J. Am. Chem. Soc., 1973, 95, 7580. [all data]
Bodor, Dewar, et al., 1970
Bodor, N.; Dewar, M.J.S.; Worley, S.D.,
Photoelectron spectra of molecules. III. Ionization potentials of some cyclic hydrocarbons and their derivatives, and heats of formation and ionization potentials calculated by the MINDO SCF MO method,
J. Am. Chem. Soc., 1970, 92, 19. [all data]