2,3,5,6-Tetrafluoroaniline
- Formula: C6H3F4N
- Molecular weight: 165.0883
- IUPAC Standard InChIKey: SPSWJTZNOXMMMV-UHFFFAOYSA-N
- CAS Registry Number: 700-17-4
- Chemical structure:
View 3d structure (requires JavaScript / HTML 5) - Other names: 2,3,5,6-Tetrafluoraniline; 1-Amino-2,3,5,6-tetrafluorobenzene; Benzenamine, 2,3,5,6-tetrafluoro-; Aniline, 2,3,5,6-tetrafluoro-

Phase change data

Data compiled by: Robert L. Brown and Stephen E. Stein
Quantity | Value | Units | Method | Reference | Comment |
---|---|---|---|---|---|
Tboil | 431. | K | N/A | PCR Inc., 1990 | |
Tboil | 431.2 | K | N/A | Weast and Grasselli, 1989 |

Gas phase ion energetics data

Data compiled by: Sharon G. Lias, John E. Bartmess, Joel F. Liebman, John L. Holmes, Rhoda D. Levin, and W. Gary Mallard
Ionization energy determinations
IE (eV) | Method | Reference | Comment |
---|---|---|---|
8.90 | PE | Furin, Sultanov, et al., 1987 | Vertical value |

References

PCR Inc., 1990
PCR Inc.,
Research Chemicals Catalog 1990-1991, PCR Inc., Gainesville, FL, 1990, 1. [all data]
Weast and Grasselli, 1989
CRC Handbook of Data on Organic Compounds, 2nd Editon, Weast,R.C and Grasselli, J.G., ed(s)., CRC Press, Inc., Boca Raton, FL, 1989, 1. [all data]
Furin, Sultanov, et al., 1987
Furin, G.G.; Sultanov, A.S.; Furlei, I.I.,
Photoelectronic spectra of fluorine-containing aromatic amines,
Dokl. Phys. Chem., 1987, 530. [all data]
Brooke, Burdon, et al., 1960
Brooke, G.M.; Burdon, J.; Stacey, M.; Tatlow, J.C.,
Aromatic polyfluoro-compounds. Part IV. The reaction of aromatic polyfluoro-compounds with nitrogen-containing bases,
J. Chem. Soc., 1960, 1768-1771. [all data]