2,3-Pyridinedicarboxylic anhydride
- Formula: C7H3NO3
- Molecular weight: 149.1036
- IUPAC Standard InChIKey: MCQOWYALZVKMAR-UHFFFAOYSA-N
- CAS Registry Number: 699-98-9
- Chemical structure:
View 3d structure (requires JavaScript / HTML 5) - Other names: Pyridine-2,3-dicarboxylic anhydride; Furo[3,4-b]pyridine-5,7-dione

Gas phase ion energetics data

Data compiled as indicated in comments:
LLK - Sharon G. Lias, Rhoda D. Levin, and Sherif A. Kafafi
B - John E. Bartmess
Electron affinity determinations
EA (eV) | Method | Reference | Comment |
---|---|---|---|
1.388 ± 0.087 | IMRE | Paul and Kebarle, 1989 | ΔGea(423 K) = -30.7±1 kcal/mol, ΔS(est) = -3±3 eu; B |
Ionization energy determinations
IE (eV) | Method | Reference | Comment |
---|---|---|---|
10.5 ± 0.1 | PE | Bigotto, Galasso, et al., 1978 | Vertical value; LLK |

References

Paul and Kebarle, 1989
Paul, G.; Kebarle, P.,
Electron Affinities of Cyclic Unsaturated Dicarbonyls: Maleic Anhydrides, Maleimides, and Cyclopentendione,
J. Am. Chem. Soc., 1989, 111, 2, 464, https://doi.org/10.1021/ja00184a009
. [all data]
Bigotto, Galasso, et al., 1978
Bigotto, A.; Galasso, V.; Colonna, F.P.; Distefano, G.; Pappalardo, G.C.; Scarlata, G.,
Electronic structure and photophysical properties of quinolinic anhydride, quinolinic thioanhydride, and N-methylquinolinimide,
J. Chem. Soc. Perkin Trans. 2, 1978, 11, 1194. [all data]