Benzene, 1,4-bis(methylthio)-
- Formula: C8H10S2
- Molecular weight: 170.295
- IUPAC Standard InChIKey: CVZBYEKCIDMLRV-UHFFFAOYSA-N
- CAS Registry Number: 699-20-7
- Chemical structure:
View 3d structure (requires JavaScript / HTML 5) - Species with the same structure:

Gas phase ion energetics data

Data compiled as indicated in comments:
LLK - Sharon G. Lias, Rhoda D. Levin, and Sherif A. Kafafi
Ionization energy determinations
IE (eV) | Method | Reference | Comment |
---|---|---|---|
7.93 | PE | Chmutova, Vtyurina, et al., 1979 | Vertical value; LLK |
7.93 | PE | Bock and Wagner, 1972 | Vertical value; LLK |

References

Chmutova, Vtyurina, et al., 1979
Chmutova, G.A.; Vtyurina, N.N.; Komina, T.V.; Gazizov, I.G.; Bock, H.,
Molecular-orbital characteristics of anisole isologs X-C6H4-ECH3 (E = O, S, Se) containing donor substituents X,
Zh. Obshch. Khim., 1979, 49, 192. [all data]
Bock and Wagner, 1972
Bock, H.; Wagner, G.,
Electron lone pairs in organic sulfides and disulfides,
Angew. Chem. Int. Ed. Engl., 1972, 11, 119. [all data]