Xanthine
- Formula: C5H4N4O2
- Molecular weight: 152.1109
- IUPAC Standard InChIKey: LRFVTYWOQMYALW-UHFFFAOYSA-N
- CAS Registry Number: 69-89-6
- Chemical structure:

Condensed phase thermochemistry data

Data compiled as indicated in comments:
ALS - Hussein Y. Afeefy, Joel F. Liebman, and Stephen E. Stein
DH - Eugene S. Domalski and Elizabeth D. Hearing
Quantity | Value | Units | Method | Reference | Comment |
---|---|---|---|---|---|
ΔfH°solid | -379.6 ± 0.92 | kJ/mol | Ccb | Stiehler and Huffman, 1935 | Reanalyzed by Cox and Pilcher, 1970, Original value = -384.1 kJ/mol; ALS |
Quantity | Value | Units | Method | Reference | Comment |
ΔcH°solid | -2159.7 ± 0.88 | kJ/mol | Ccb | Stiehler and Huffman, 1935 | Reanalyzed by Cox and Pilcher, 1970, Original value = -2159.0 ± 1.5 kJ/mol; ALS |
Quantity | Value | Units | Method | Reference | Comment |
S°solid,1 bar | 161.1 | J/mol*K | N/A | Stiehler and Huffman, 1935, 2 | Extrapolation below 90 K, 48.87 J/mol*K.; DH |
Constant pressure heat capacity of solid
Cp,solid (J/mol*K) | Temperature (K) | Reference | Comment |
---|---|---|---|
151.34 | 298.5 | Stiehler and Huffman, 1935, 2 | T = 85 to 299 K. Value is unsmoothed experimental datum.; DH |

Gas phase ion energetics data

Data compiled as indicated in comments:
LLK - Sharon G. Lias, Rhoda D. Levin, and Sherif A. Kafafi
RDSH - Henry M. Rosenstock, Keith Draxl, Bruce W. Steiner, and John T. Herron
Ionization energy determinations
IE (eV) | Method | Reference | Comment |
---|---|---|---|
8.55 | PE | Dougherty, Younathan, et al., 1978 | LLK |
9.3 ± 0.2 | EI | Lifschitz, Bergmann, et al., 1967 | RDSH |
8.89 ± 0.03 | PE | Hush and Cheung, 1975 | Vertical value; LLK |

References

Stiehler and Huffman, 1935
Stiehler, R.D.; Huffman, H.M.,
Thermal data. IV. The heats of combustion of adenine, hypoxanthine, guanine, xanthine, uric acid, allantoin and alloxan,
J. Am. Chem. Soc., 1935, 57, 1734-1740. [all data]
Cox and Pilcher, 1970
Cox, J.D.; Pilcher, G.,
Thermochemistry of Organic and Organometallic Compounds, Academic Press, New York, 1970, 1-636. [all data]
Stiehler and Huffman, 1935, 2
Stiehler, R.D.; Huffman, H.M.,
Thermal data. V. The heat capacities, entropies and free energies of adenine, hypoxanthine, guanine, xanthine, uric acid, allantoin and alloxan,
J. Am. Chem. Soc., 1935, 57, 1741-1743. [all data]
Dougherty, Younathan, et al., 1978
Dougherty, D.; Younathan, E.S.; Voll, R.; Abdulnur, S.; McGlynn, S.P.,
Photoelectron spectroscopy of some biological molecules,
J. Electron Spectrosc. Relat. Phenom., 1978, 13, 379. [all data]
Lifschitz, Bergmann, et al., 1967
Lifschitz, C.; Bergmann, E.D.; Pullman, B.,
The ionization potentials of biological purines and pyrimidines,
Tetrahedron Lett., 1967, 4583. [all data]
Hush and Cheung, 1975
Hush, N.S.; Cheung, A.S.,
Ionization potentials and donor properties of nucleic acid bases and related compounds,
Chem. Phys. Lett., 1975, 34, 11. [all data]
Cavalieri and Brown, 1948
Cavalieri, L.F.; Brown, G.B.,
J. Am. Chem. Soc., 1948, 70, 3875. [all data]