p-Iodo-N,N-dimethylaniline
- Formula: C8H10IN
- Molecular weight: 247.0762
- IUPAC Standard InChIKey: QYOPPZJZMFMBDN-UHFFFAOYSA-N
- CAS Registry Number: 698-70-4
- Chemical structure:
View 3d structure (requires JavaScript / HTML 5) - Other names: Aniline, p-iodo-N,N-dimethyl-; Benzenamine, 4-iodo-N,N-dimethyl-; N,N-Dimethyl-4-iodoaniline

Gas phase ion energetics data

Data compiled by: Henry M. Rosenstock, Keith Draxl, Bruce W. Steiner, and John T. Herron
Appearance energy determinations
Ion | AE (eV) | Other Products | Method | Reference | Comment |
---|---|---|---|---|---|
C8H10NI+ | 7.29 | ? | CTS | Farrell and Newton, 1965 |

References

Farrell and Newton, 1965
Farrell, P.G.; Newton, J.,
Ionization potentials of aromatic amines,
J. Phys. Chem., 1965, 69, 3506. [all data]