Ethanethiol, 2-bromo-
- Formula: C2H5BrS
- Molecular weight: 141.030
- IUPAC Standard InChIKey: NISIKGZIQILZRC-UHFFFAOYSA-N
- CAS Registry Number: 6982-46-3
- Chemical structure:
View 3d structure (requires JavaScript / HTML 5) - Permanent link for this species. Use this link for bookmarking this species for future reference.

Gas phase ion energetics data

Data compiled by: Sharon G. Lias, Rhoda D. Levin, and Sherif A. Kafafi
Appearance energy determinations
Ion | AE (eV) | Other Products | Method | Reference | Comment |
---|---|---|---|---|---|
C2H5S+ | 10.1 ± 0.15 | Br | EI | Broer, Weringa, et al., 1979 |

References

Broer, Weringa, et al., 1979
Broer, W.J.; Weringa, W.D.; Nieuwpoort, W.C.,
Rearrangements and fragmentations of [C2H5S]+ ions,
Org. Mass Spectrom., 1979, 14, 543. [all data]