Decane, 2-methyl-
- Formula: C11H24
- Molecular weight: 156.3083
- IUPAC Standard InChIKey: CNPVJWYWYZMPDS-UHFFFAOYSA-N
- CAS Registry Number: 6975-98-0
- Chemical structure:
View 3d structure (requires JavaScript / HTML 5) - Other names: 2-Methyldecane; n-C8H17CH(CH3)2

Gas phase thermochemistry data

Data compiled by: Glushko Thermocenter, Russian Academy of Sciences, Moscow
Quantity | Value | Units | Method | Reference | Comment |
---|---|---|---|---|---|
S°gas | 578.3 ± 2.0 | J/mol*K | N/A | Messerly J.F., 1971 |

Condensed phase thermochemistry data

Data compiled by: Eugene S. Domalski and Elizabeth D. Hearing
Quantity | Value | Units | Method | Reference | Comment |
---|---|---|---|---|---|
S°liquid | 453.80 | J/mol*K | N/A | Messerly and Finke, 1971 |
Constant pressure heat capacity of liquid
Cp,liquid (J/mol*K) | Temperature (K) | Reference | Comment |
---|---|---|---|
341.21 | 298.15 | Messerly and Finke, 1971 | T = 11 to 390 K. |

Phase change data

Data compiled as indicated in comments:
BS - Robert L. Brown and Stephen E. Stein
TRC - Thermodynamics Research Center, NIST Boulder Laboratories, Chris Muzny director
AC - William E. Acree, Jr., James S. Chickos
DH - Eugene S. Domalski and Elizabeth D. Hearing
Quantity | Value | Units | Method | Reference | Comment |
---|---|---|---|---|---|
Tboil | 462.4 | K | N/A | Weast and Grasselli, 1989 | BS |
Tboil | 462.4 | K | N/A | Majer and Svoboda, 1985 | |
Tboil | 462.30 | K | N/A | Anonymous, 1950 | Uncertainty assigned by TRC = 0.5 K; TRC |
Tboil | 462.3 | K | N/A | Boord, Greenlee, et al., 1950 | Uncertainty assigned by TRC = 0.2 K; TRC |
Tboil | 462.27 | K | N/A | Boord, Greenlee, et al., 1950 | Uncertainty assigned by TRC = 0.2 K; TRC |
Quantity | Value | Units | Method | Reference | Comment |
Tfus | 224.28 ± 0.02 | K | AVG | N/A | Average of 7 values; Individual data points |
Quantity | Value | Units | Method | Reference | Comment |
Ttriple | 224.3000 | K | N/A | Messerly and Finke, 1971, 2 | Uncertainty assigned by TRC = 0.01 K; TRC |
Ttriple | 224.3100 | K | N/A | Messerly and Finke, 1971, 2 | Uncertainty assigned by TRC = 0.005 K; by extrapolation of 1/F to 0, corrected for impurities; TRC |
Quantity | Value | Units | Method | Reference | Comment |
Tc | 629.9 | K | N/A | Majer and Svoboda, 1985 | |
Quantity | Value | Units | Method | Reference | Comment |
ΔvapH° | 54.29 | kJ/mol | N/A | Majer and Svoboda, 1985 |
Enthalpy of vaporization
ΔvapH (kJ/mol) | Temperature (K) | Method | Reference | Comment |
---|---|---|---|---|
40.25 | 462.4 | N/A | Majer and Svoboda, 1985 | |
55.5 | 288. | A | Stephenson and Malanowski, 1987 | Based on data from 273. to 353. K.; AC |
47.4 | 394. | A | Stephenson and Malanowski, 1987 | Based on data from 379. to 463. K.; AC |
51.9 | 328. | C | Majer, Svoboda, et al., 1984 | AC |
50.6 | 343. | C | Majer, Svoboda, et al., 1984 | AC |
49.5 | 358. | C | Majer, Svoboda, et al., 1984 | AC |
55.4 | 283. | IP | Osborn and Douslin, 1974 | Based on data from 273. to 293. K.; AC |
Enthalpy of vaporization
ΔvapH =
A exp(-βTr) (1 − Tr)β
ΔvapH =
Enthalpy of vaporization (at saturation pressure)
(kJ/mol)
Tr = reduced temperature (T / Tc)
View plot Requires a JavaScript / HTML 5 canvas capable browser.
Temperature (K) | A (kJ/mol) | β | Tc (K) | Reference | Comment |
---|---|---|---|---|---|
328. to 368. | 77.26 | 0.3168 | 629.9 | Majer and Svoboda, 1985 |
Antoine Equation Parameters
log10(P) = A − (B / (T + C))
P = vapor pressure (bar)
T = temperature (K)
View plot Requires a JavaScript / HTML 5 canvas capable browser.
Temperature (K) | A | B | C | Reference | Comment |
---|---|---|---|---|---|
273. to 462.37 | 4.21961 | 1640.288 | -72.933 | Osborn and Douslin, 1974 | Coefficents calculated by NIST from author's data. |
Enthalpy of fusion
ΔfusH (kJ/mol) | Temperature (K) | Reference | Comment |
---|---|---|---|
25.087 | 224.31 | Messerly and Finke, 1971 | DH |
25.06 | 224.3 | Domalski and Hearing, 1996 | AC |
Entropy of fusion
ΔfusS (J/mol*K) | Temperature (K) | Reference | Comment |
---|---|---|---|
111.84 | 224.31 | Messerly and Finke, 1971 | DH |

Gas phase ion energetics data

Data evaluated as indicated in comments:
L - Sharon G. Lias
Data compiled as indicated in comments:
LL - Sharon G. Lias and Joel F. Liebman
LBLHLM - Sharon G. Lias, John E. Bartmess, Joel F. Liebman, John L. Holmes, Rhoda D. Levin, and W. Gary Mallard
LLK - Sharon G. Lias, Rhoda D. Levin, and Sherif A. Kafafi
Quantity | Value | Units | Method | Reference | Comment |
---|---|---|---|---|---|
IE (evaluated) | 9.7 | eV | N/A | N/A | L |
Ionization energy determinations
IE (eV) | Method | Reference | Comment |
---|---|---|---|
9.34 | EST | Luo and Pacey, 1992 | LL |
9.7 ± 0.1 | EQ | Lias, 1982 | LBLHLM |
9.57 ± 0.15 | EQ | Mautner(Meot-Ner), Sieck, et al., 1981 | LLK |

Van Den Dool and Kratz RI, non-polar column, temperature ramp

Data compiled by: NIST Mass Spectrometry Data Center, William E. Wallace, director

Column type CapillaryCapillaryCapillaryCapillaryCapillary
Active phase HP-5MSDB-5Petrocol DHCP Sil 8 CBOV-101
Column length (m) 30.30.50.60.80.
Carrier gas HeHeHeHeN2
Substrate
Column diameter (mm) 0.250.320.250.250.22
Phase thickness (μm) 0.250.250.50.25
Tstart (C) 60.60.35.40.30.
Tend (C) 280.280.200.250.130.
Heat rate (K/min) 4.3.3.4.1.
Initial hold (min) 5. 10.8.
Final hold (min)   10.10.
I 1076.1061.1065.91059.1063.9
ReferenceSaroglou, Marin, et al., 2007Pavlovic, Tzakou, et al., 2006Censullo, Jones, et al., 2003Oruna-Concha, Ames, et al., 2002Yin, Liu, et al., 2001
Comment MSDC-RI MSDC-RI MSDC-RI MSDC-RI MSDC-RI
Column type CapillaryCapillaryCapillaryCapillaryCapillary
Active phase Petrocol DHCross-Linked MethylsiliconeUltra-1Ultra-1Ultra-1
Column length (m) 100. 50.50.50.
Carrier gas He HeHeHe
Substrate
Column diameter (mm) 0.25 0.220.220.22
Phase thickness (μm) 0.5 0.330.330.33
Tstart (C) 30.40.-30.-30.-30.
Tend (C) 220.300.240.240.240.
Heat rate (K/min) 1.5.1.2.3.
Initial hold (min)
Final hold (min)
I 1068.1065.1065.781065.561065.83
ReferenceWhite, Hackett, et al., 1992Khorasheh, Gray, et al., 1989Haynes and Pitzer, 1985Haynes and Pitzer, 1985Haynes and Pitzer, 1985
Comment MSDC-RI MSDC-RI MSDC-RI MSDC-RI MSDC-RI
Column type CapillaryCapillaryCapillaryCapillary
Active phase Ultra-2Ultra-2Ultra-2OV-101
Column length (m) 50.50.50.108.
Carrier gas HeHeHe
Substrate
Column diameter (mm) 0.220.220.220.25
Phase thickness (μm) 0.330.330.330.2
Tstart (C) -30.-30.-30.35.
Tend (C) 240.240.240.200.
Heat rate (K/min) 1.2.3.1.
Initial hold (min)
Final hold (min)
I 1064.981064.931065.011065.
ReferenceHaynes and Pitzer, 1985Haynes and Pitzer, 1985Haynes and Pitzer, 1985Hayes and Pitzer, 1981
Comment MSDC-RI MSDC-RI MSDC-RI MSDC-RI

Normal alkane RI, non-polar column, temperature ramp

Data compiled by: NIST Mass Spectrometry Data Center, William E. Wallace, director

Column type CapillaryCapillaryCapillaryCapillaryCapillary
Active phase Polydimethyl siloxane: CP-Sil 5 CBHP-5 MSRTX-1PONAOV-1
Column length (m) 60.30.60.50.100.
Carrier gas HeliumHeliumHeliumNitrogenHelium
Substrate
Column diameter (mm) 0.250.250.220.200.32
Phase thickness (μm) 1.00.250.250.500.25
Tstart (C) 45.35.60.35.30.
Tend (C) 210.300.230.200.310.
Heat rate (K/min) 3.63.2.2.5.
Initial hold (min) 1.455. 15.
Final hold (min) 2.7215.30.10.5.
I 1067.1065.1068.1066.1065.6
ReferenceBramston-Cook, 2013Kotowska, Zalikowski, et al., 2012Dib, Djabou, et al., 2010Zhang, Ding, et al., 2009Krkosova, Kubinec, et al., 2007
Comment MSDC-RI MSDC-RI MSDC-RI MSDC-RI MSDC-RI
Column type CapillaryCapillaryCapillaryCapillaryCapillary
Active phase DB-5HP-5MSDB-5HP-5DB-5
Column length (m) 30.30.30.30.25.
Carrier gas HeHeHeHeliumHe
Substrate
Column diameter (mm) 0.250.250.250.320.2
Phase thickness (μm) 0.250.250.250.25
Tstart (C) 60.50.60.40.60.
Tend (C) 320.280.300.250.220.
Heat rate (K/min) 10.5.3.5.3.
Initial hold (min)  4.3.2.
Final hold (min) 4.10. 5.
I 1068.1069.1059.1067.1061.
ReferenceSmelcerovic, Spiteller, et al., 2007Kim, El-Aty, et al., 2006Ferraz, Limberger, et al., 2005N/ASchwob, Bessière, et al., 2002
Comment MSDC-RI MSDC-RI MSDC-RI MSDC-RI MSDC-RI
Column type Capillary
Active phase OV-101
Column length (m) 50.
Carrier gas Helium
Substrate
Column diameter (mm) 0.20
Phase thickness (μm) 0.50
Tstart (C) 30.
Tend (C) 100.
Heat rate (K/min) 1.
Initial hold (min) 6.
Final hold (min)
I 1063.
ReferenceOrav, Kailas, et al., 1999
Comment MSDC-RI

Normal alkane RI, non-polar column, custom temperature program

Data compiled by: NIST Mass Spectrometry Data Center, William E. Wallace, director

Column type CapillaryCapillaryCapillaryCapillaryCapillary
Active phase HP-5 MSRTX-1OV-1DB-1SE-52
Column length (m) 30.60.30.30.30.
Carrier gas HeliumHeliumHeliumHeHe
Substrate
Column diameter (mm) 0.250.220.250.250.32
Phase thickness (μm) 0.250.250.250.250.15
Program not specifiednot specified30 0C (50 min) 2 0C/min -> 90 0C 30 0C/min -> 300 0C (3 min)45C => 3C/min => 175C => 15C/min => 300C (10min)45C => 1C/min => 100C => 5C/min => 250C (10min)
I 1064.1065.1065.1058.1064.
ReferenceKotowska, Zalikowski, et al., 2012Dib, Djabou, et al., 2010Zhang and Liang, 2009Nogueira, Marcelo-Curto, et al., 2008Tognolini, Barocelli, et al., 2006
Comment MSDC-RI MSDC-RI MSDC-RI MSDC-RI MSDC-RI
Column type CapillaryCapillaryCapillaryCapillary
Active phase OV-101HP-5SqualaneOV-1, SE-30, Methyl silicone, SP-2100, OV-101, DB-1, etc.
Column length (m)  50. 50.
Carrier gas  He Hydrogen
Substrate
Column diameter (mm)  0.32 0.32
Phase thickness (μm)  0.52
Program not specified35 0C 10 0C/min -> 200 0C (20 min) 5 0C/min -> 230 0C (50 min)not specifiednot specified
I 1062.1024.1063.1065.
ReferenceDu and Liang, 2003Timón, Ventanas, et al., 1998Petrov, 1984Waggott and Davies, 1984
Comment MSDC-RI MSDC-RI MSDC-RI MSDC-RI

References

Messerly J.F., 1971
Messerly J.F.,
Low-temperature thermal properties of 2-methylheptane and 2-methyldecane: the thermodynamic properties of 2-methylalkanes,
J. Chem. Thermodyn., 1971, 3, 675-687. [all data]
Messerly and Finke, 1971
Messerly, J.F.; Finke, H.L.,
Low-temperature thermal properties of 2-methylheptane and 2-methyldecane: the thermodynamic properties of the 2-methylalkanes,
J. Chem. Thermodynam., 1971, 3, 675-687. [all data]
Weast and Grasselli, 1989
CRC Handbook of Data on Organic Compounds, 2nd Editon, Weast,R.C and Grasselli, J.G., ed(s)., CRC Press, Inc., Boca Raton, FL, 1989, 1. [all data]
Majer and Svoboda, 1985
Majer, V.; Svoboda, V.,
Enthalpies of Vaporization of Organic Compounds: A Critical Review and Data Compilation, Blackwell Scientific Publications, Oxford, 1985, 300. [all data]
Anonymous, 1950
Anonymous, R.,
, Am. Pet. Inst. Res. Proj. 6, Natl. Bur. Stand., 1950. [all data]
Boord, Greenlee, et al., 1950
Boord, C.E.; Greenlee, K.W.; Derfer, J.M.,
The Synthesis, Purification and Prop. of Hydrocarbons of Low Mol. Wt., Am. Pet. Inst. Res. Proj. 45, Twelfth Annu. Rep., Ohio State Univ., 1950. [all data]
Messerly and Finke, 1971, 2
Messerly, J.F.; Finke, H.L.,
Low-temperature Thermal Properties of 2-Methyldecane: the Thermodynamic Properties of the 2-Methylalkanes,
J. Chem. Thermodyn., 1971, 3, 675-87. [all data]
Stephenson and Malanowski, 1987
Stephenson, Richard M.; Malanowski, Stanislaw,
Handbook of the Thermodynamics of Organic Compounds, 1987, https://doi.org/10.1007/978-94-009-3173-2
. [all data]
Majer, Svoboda, et al., 1984
Majer, V.; Svoboda, V.; Pechacek, J.; Hala, S.,
Enthalpies of vaporization and cohesive energies of eight C9 to C11,
J. Chem. Thermodyn., 1984, 16, 567-572. [all data]
Osborn and Douslin, 1974
Osborn, Ann G.; Douslin, Donald R.,
Vapor-pressure relations for 15 hydrocarbons,
J. Chem. Eng. Data, 1974, 19, 2, 114-117, https://doi.org/10.1021/je60061a022
. [all data]
Domalski and Hearing, 1996
Domalski, Eugene S.; Hearing, Elizabeth D.,
Heat Capacities and Entropies of Organic Compounds in the Condensed Phase. Volume III,
J. Phys. Chem. Ref. Data, 1996, 25, 1, 1, https://doi.org/10.1063/1.555985
. [all data]
Luo and Pacey, 1992
Luo, Y.-R.; Pacey, P.D.,
Effects of alkyl substitution on ionization energies of alkanes and haloalkanes and on heats of formation of their molecular cations. Part 2. Alkanes and chloro-, bromo- and iodoalkanes,
Int. J. Mass Spectrom. Ion Processes, 1992, 112, 63. [all data]
Lias, 1982
Lias, S.G.,
Thermochemical information from ion-molecule rate constants,
Ion Cyclotron Reson. Spectrom. 1982, 1982, 409. [all data]
Mautner(Meot-Ner), Sieck, et al., 1981
Mautner(Meot-Ner), M.; Sieck, L.W.; Ausloos, P.,
Ionization of normal alkanes: Enthalpy, entropy, structural, and isotope effects,
J. Am. Chem. Soc., 1981, 103, 5342. [all data]