2-Butanone, 4-methoxy-
- Formula: C5H10O2
- Molecular weight: 102.1317
- IUPAC Standard InChIKey: DRWOJIIXBYNGGW-UHFFFAOYSA-N
- CAS Registry Number: 6975-85-5
- Chemical structure:
View 3d structure (requires JavaScript / HTML 5) - Permanent link for this species. Use this link for bookmarking this species for future reference.

Gas phase ion energetics data

Data compiled by: Sharon G. Lias and Joel F. Liebman
Ionization energy determinations
IE (eV) | Method | Reference |
---|---|---|
9.37 | PI | McAdoo, Hudson, et al., 1988 |
Appearance energy determinations
Ion | AE (eV) | Other Products | Method | Reference | Comment |
---|---|---|---|---|---|
C4H8O+ | 9.67 ± 0.01 | CH2O | PI | McAdoo, Hudson, et al., 1988 |

References

McAdoo, Hudson, et al., 1988
McAdoo, D.J.; Hudson, C.E.; Traeger, J.C.,
The distonic ions HO+ = CHCH2CH2 and CH3C(=0 + H)CH2CH2,
Org. Mass Spectrom., 1988, 23, 760. [all data]