Acetamide, N-(2,4-dichlorophenyl)-
- Formula: C8H7Cl2NO
- Molecular weight: 204.053
- IUPAC Standard InChIKey: GZSGTFDLLISMMA-UHFFFAOYSA-N
- CAS Registry Number: 6975-29-7
- Chemical structure:
View 3d structure (requires JavaScript / HTML 5) - Other names: Acetanilide, 2',4'-dichloro-; 2,4-Dichloroacetanilide; 2',4'-Dichloroacetanilide

Gas phase ion energetics data

Data compiled by: Sharon G. Lias, Rhoda D. Levin, and Sherif A. Kafafi
Ionization energy determinations
IE (eV) | Method | Reference |
---|---|---|
8.09 ± 0.03 | EI | Benezra and Bursey, 1972 |
Appearance energy determinations
Ion | AE (eV) | Other Products | Method | Reference | Comment |
---|---|---|---|---|---|
C2H3O+ | 13.08 ± 0.03 | ? | EI | Benezra and Bursey, 1972 | |
C6H5NCl2+ | 10.09 ± 0.03 | CH2=C=O | EI | Benezra and Bursey, 1972 | |
C8H7NOCl+ | 8.81 ± 0.03 | ? | EI | Benezra and Bursey, 1972 |

References

Benezra and Bursey, 1972
Benezra, S.A.; Bursey, M.M.,
ortho-Effects in mass spectra. Alteration of the molecular-ion energy distribution in disubstituted acetanilides,
Z. Naturforsch. A:, 1972, 27, 670. [all data]