p-Iodoanisole
- Formula: C7H7IO
- Molecular weight: 234.0344
- IUPAC Standard InChIKey: SYSZENVIJHPFNL-UHFFFAOYSA-N
- CAS Registry Number: 696-62-8
- Chemical structure:
View 3d structure (requires JavaScript / HTML 5) - Other names: Benzene, 1-iodo-4-methoxy-; Anisole, p-iodo-; p-Iodophenyl methyl ether; p-Methoxyiodobenzene; Isoform; 1-Iodo-4-methoxybenzene; 4-Iodoanisole; 4-Iodomethoxybenzene; Anisole, 4-iodo-; p-Methoxyphenyl iodide; p-Iodomethoxybenzene; 4-Methoxyphenyl iodide; 4-Methoxyiodobenzene; p-Iodoanisol; 4-Methoxy-1-iodobenzene; NSC 60727

Phase change data

Data compiled as indicated in comments:
BS - Robert L. Brown and Stephen E. Stein
ALS - Hussein Y. Afeefy, Joel F. Liebman, and Stephen E. Stein
AC - William E. Acree, Jr., James S. Chickos
Quantity | Value | Units | Method | Reference | Comment |
---|---|---|---|---|---|
ΔvapH° | 53.1 ± 0.4 | kJ/mol | V | Brennan and Ubbelohde, 1956 | ALS |
Reduced pressure boiling point
Tboil (K) | Pressure (bar) | Reference | Comment |
---|---|---|---|
510.2 | 0.968 | Weast and Grasselli, 1989 | BS |
Enthalpy of vaporization
ΔvapH (kJ/mol) | Temperature (K) | Method | Reference | Comment |
---|---|---|---|---|
54.4 | 416. | A | Stephenson and Malanowski, 1987 | Based on data from 401. to 520. K. See also Dykyj, Svoboda, et al., 1999.; AC |
53.1 ± 0.4 | 440. | I | Brennan and Ubbelohde, 1956, 2 | Based on data from 401. to 479. K.; AC |

Reaction thermochemistry data

Data compiled by: Hussein Y. Afeefy, Joel F. Liebman, and Stephen E. Stein
Individual Reactions
By formula: HI + C7H7IO = C7H8O + I2
Quantity | Value | Units | Method | Reference | Comment |
---|---|---|---|---|---|
ΔrH° | -29. ± 5.0 | kJ/mol | Cm | Brennan and Ubbelohde, 1956 | gas phase |

Gas phase ion energetics data

Data compiled by: Sharon G. Lias, Rhoda D. Levin, and Sherif A. Kafafi
Ionization energy determinations
IE (eV) | Method | Reference |
---|---|---|
7.97 | PE | Behan, Johnstone, et al., 1976 |

Kovats' RI, non-polar column, isothermal

Column type | Active phase | Temperature (C) | I | Reference | Comment |
---|---|---|---|---|---|
Packed | Apolane | 150. | 1326. | Evans and Haken, 1987 | He, Chromosorb G AW DCMS; Column length: 3.7 m |
Packed | Apolane | 150. | 1326. | Haken and Vernon, 1986 | Chromosorb G AW DCMS; Column length: 3.7 m |

Kovats' RI, polar column, isothermal

Column type | Active phase | Temperature (C) | I | Reference | Comment |
---|---|---|---|---|---|
Packed | Carbowax 20M | 150. | 1852. | Haken and Vernon, 1986 | Chromosorb G AW DCMS; Column length: 3.7 m; Column diameter: 6.4 mm |

References

Brennan and Ubbelohde, 1956
Brennan, D.; Ubbelohde, A.R.,
A thermochemical evaluation of bond strengths in some carbon compounds. Part IV. Bond-strength differences based on the reaction: RI + HI = RH + I2, where R = p-methoxyphenyl and cyclohexyl,
J. Chem. Soc., 1956, 3011-3016. [all data]
Weast and Grasselli, 1989
CRC Handbook of Data on Organic Compounds, 2nd Editon, Weast,R.C and Grasselli, J.G., ed(s)., CRC Press, Inc., Boca Raton, FL, 1989, 1. [all data]
Stephenson and Malanowski, 1987
Stephenson, Richard M.; Malanowski, Stanislaw,
Handbook of the Thermodynamics of Organic Compounds, 1987, https://doi.org/10.1007/978-94-009-3173-2
. [all data]
Dykyj, Svoboda, et al., 1999
Dykyj, J.; Svoboda, J.; Wilhoit, R.C.; Frenkel, M.L.; Hall, K.R.,
Vapor Pressure of Chemicals: Part A. Vapor Pressure and Antoine Constants for Hydrocarbons and Sulfur, Selenium, Tellurium and Hydrogen Containing Organic Compounds, Springer, Berlin, 1999, 373. [all data]
Brennan and Ubbelohde, 1956, 2
Brennan, D.; Ubbelohde, A.R.,
584. A thermochemical evaluation of bond strengths in some carbon compounds. Part IV. Bond-strength differences based on the reaction: RI + HI ? RH + I2, where R =p-methoxyphenyl and cyclohexyl,
J. Chem. Soc., 1956, 3011, https://doi.org/10.1039/jr9560003011
. [all data]
Behan, Johnstone, et al., 1976
Behan, J.M.; Johnstone, R.A.W.; Bentley, T.W.,
An evaluation of empirical methods for calculating the ionization potentials of substituted benzenes,
Org. Mass Spectrom., 1976, 11, 207. [all data]
Evans and Haken, 1987
Evans, M.B.; Haken, J.K.,
Dispersion and selectivity indices of the halogenated derivatives of cyclohexane, benzene and anisole,
J. Chromatogr., 1987, 389, 240-244, https://doi.org/10.1016/S0021-9673(01)94428-0
. [all data]
Haken and Vernon, 1986
Haken, J.K.; Vernon, F.,
Gas chromatography of halogenated derivatives of cyclohexane, benzene and anisole,
J. Chromatogr., 1986, 361, 57-61, https://doi.org/10.1016/S0021-9673(01)86893-X
. [all data]