Benzenamine, N,3-dimethyl-
- Formula: C8H11N
- Molecular weight: 121.1796
- IUPAC Standard InChIKey: FBGJJTQNZVNEQU-UHFFFAOYSA-N
- CAS Registry Number: 696-44-6
- Chemical structure:
View 3d structure (requires JavaScript / HTML 5) - Other names: m-Toluidine, N-methyl-; Aniline, N,m-dimethyl-; N-Methyl-m-toluidine; N-Methyl-3-methylaniline; N,3-Dimethylaniline; N,3-Dimethylbenzenamine; m,N-Dimethylaniline

Phase change data

Data compiled by: Robert L. Brown and Stephen E. Stein
Quantity | Value | Units | Method | Reference | Comment |
---|---|---|---|---|---|
Tboil | 479.7 | K | N/A | Weast and Grasselli, 1989 |

Gas phase ion energetics data

Data compiled as indicated in comments:
LLK - Sharon G. Lias, Rhoda D. Levin, and Sherif A. Kafafi
RDSH - Henry M. Rosenstock, Keith Draxl, Bruce W. Steiner, and John T. Herron
Ionization energy determinations
IE (eV) | Method | Reference | Comment |
---|---|---|---|
7.26 | PE | Cowling and Johnstone, 1973 | LLK |
7.5 ± 0.1 | EI | Eland, Shepherd, et al., 1966 | RDSH |

Kovats' RI, polar column, isothermal

Column type | Active phase | Temperature (C) | I | Reference | Comment |
---|---|---|---|---|---|
Packed | Carbowax 20M | 150. | 1811.4 | Ellis and Still, 1979 | Chromosorb W, AW-DMCS |
Packed | Carbowax 20M | 150. | 1810.7 | Ellis and Still, 1979 | Chromosorb W, AW-DMCS |

References

Weast and Grasselli, 1989
CRC Handbook of Data on Organic Compounds, 2nd Editon, Weast,R.C and Grasselli, J.G., ed(s)., CRC Press, Inc., Boca Raton, FL, 1989, 1. [all data]
Cowling and Johnstone, 1973
Cowling, S.A.; Johnstone, R.A.W.,
Photoelectron spectroscopy: The effects of steric inhibition to resonance in anilines,
J. Electron Spectrosc. Relat. Phenom., 1973, 2, 161. [all data]
Eland, Shepherd, et al., 1966
Eland, J.H.D.; Shepherd, P.J.; Danby, C.J.,
Ionization potentials of aromatic molecules determined by analytical interpretation of electron impact data,
Z. Naturforsch., 1966, 21a, 1580. [all data]
Ellis and Still, 1979
Ellis, T.S.; Still, R.H.,
Thermal degradation of polymers. XXI. Vacuum pyrolysis of poly(m-N,N-dimethylaminostyrene); the products volatile at pyrolysis temperature, liquid at room temperature,
J. Appl. Polym. Sci., 1979, 23, 10, 2837-2854, https://doi.org/10.1002/app.1979.070231002
. [all data]