[2.2.2.2](1,2,3,4)Cyclophane
- Formula: C20H20
- Molecular weight: 260.3728
- IUPAC Standard InChIKey: KLKMVVVPOCQWDO-UHFFFAOYSA-N
- CAS Registry Number: 69631-55-6
- Chemical structure:
View 3d structure (requires JavaScript / HTML 5) - Permanent link for this species. Use this link for bookmarking this species for future reference.

Gas phase ion energetics data

Data compiled by: Sharon G. Lias, Rhoda D. Levin, and Sherif A. Kafafi
Ionization energy determinations
IE (eV) | Method | Reference | Comment |
---|---|---|---|
7.9 ± 0.1 | PE | Kovac, Mohraz, et al., 1980 | Vertical value |

References

Kovac, Mohraz, et al., 1980
Kovac, B.; Mohraz, M.; Heilbronner, E.; Boekelheide, V.; Hopf, H.,
Photoelectron spectra of the cyclophanes,
J. Am. Chem. Soc., 1980, 102, 4314. [all data]