Arsine,dimethylphenyl-
- Formula: C8H11As
- Molecular weight: 182.0945
- IUPAC Standard InChIKey: KZTHCQYZOHMORT-UHFFFAOYSA-N
- CAS Registry Number: 696-26-4
- Chemical structure:
View 3d structure (requires JavaScript / HTML 5) - Other names: Dimethylphenylarsine

Gas phase ion energetics data

Data compiled by: Sharon G. Lias, Rhoda D. Levin, and Sherif A. Kafafi
Ionization energy determinations
IE (eV) | Method | Reference | Comment |
---|---|---|---|
8.67 | PE | Schmidt, Schweig, et al., 1977 | Vertical value |

References

Schmidt, Schweig, et al., 1977
Schmidt, H.; Schweig, A.; Vermeer, H.,
On the conformation of unsaturated arsines,
J. Mol. Struct., 1977, 37, 93. [all data]
Bowden and Braude, 1952
Bowden, K.; Braude, E.A.,
J. Chem. Soc., 1952, 1068. [all data]