Aziridine, 1-phenyl-
- Formula: C8H9N
- Molecular weight: 119.1638
- IUPAC Standard InChIKey: YKNKBBMRKMLLJS-UHFFFAOYSA-N
- CAS Registry Number: 696-18-4
- Chemical structure:
View 3d structure (requires JavaScript / HTML 5) - Other names: N-Phenylaziridine; N-Phenylethylenimine; 1-Phenylaziridine

Gas phase ion energetics data

Data evaluated as indicated in comments:
HL - Edward P. Hunter and Sharon G. Lias
Data compiled as indicated in comments:
LBLHLM - Sharon G. Lias, John E. Bartmess, Joel F. Liebman, John L. Holmes, Rhoda D. Levin, and W. Gary Mallard
Quantity | Value | Units | Method | Reference | Comment |
---|---|---|---|---|---|
Proton affinity (review) | 926.5 | kJ/mol | N/A | Hunter and Lias, 1998 | HL |
Quantity | Value | Units | Method | Reference | Comment |
Gas basicity | 895.7 | kJ/mol | N/A | Hunter and Lias, 1998 | HL |
Ionization energy determinations
IE (eV) | Method | Reference | Comment |
---|---|---|---|
8.0 ± 0.1 | PE | Rozeboom, Houk, et al., 1982 | LBLHLM |
8.0 | PE | Crimaldi, Lichter, et al., 1982 | LBLHLM |
8.19 ± 0.06 | PE | Rozeboom, Houk, et al., 1982 | Vertical value; LBLHLM |
8.1 | PE | Crimaldi, Lichter, et al., 1982 | Vertical value; LBLHLM |

References

Hunter and Lias, 1998
Hunter, E.P.; Lias, S.G.,
Evaluated Gas Phase Basicities and Proton Affinities of Molecules: An Update,
J. Phys. Chem. Ref. Data, 1998, 27, 3, 413-656, https://doi.org/10.1063/1.556018
. [all data]
Rozeboom, Houk, et al., 1982
Rozeboom, M.D.; Houk, K.N.; Searles, S.; Seyedrezai, S.E.,
Photoelectron spectroscopy of N-aryl cyclic amines. Variable conformations and relationships to gas- and solution-phase basicities,
J. Am. Chem. Soc., 1982, 104, 3448. [all data]
Crimaldi, Lichter, et al., 1982
Crimaldi, K.; Lichter, R.L.; Baker, A.D.,
Nitrogen-15 nuclear magnetic resonance and photoelectron spectroscopy of substituted N-ohenylaziridines,
J. Org. Chem., 1982, 47, 3524. [all data]