Tantalum, carbonyl bis(η5-cyclopentadienyl) propyl-

Gas phase ion energetics data

Data compiled by: Sharon G. Lias, Rhoda D. Levin, and Sherif A. Kafafi

Ionization energy determinations

IE (eV) Method Reference Comment
6.1 ± 0.1PEVan Dam, Terpstra, et al., 1981Vertical value

References

Van Dam, Terpstra, et al., 1981
Van Dam, H.; Terpstra, A.; Oskam, A.; Teuben, J.H., UV photoelectron spectra of some bent bis(η5-cyclopentadienyl)Niobium and tantalum complexes, Z. Naturforsch. B:, 1981, 36, 420. [all data]