1,3-Dioxane, 2,2-dimethyl-
- Formula: C6H12O2
- Molecular weight: 116.1583
- IUPAC Standard InChIKey: RPLSBADGISFNSI-UHFFFAOYSA-N
- CAS Registry Number: 695-30-7
- Chemical structure:
View 3d structure (requires JavaScript / HTML 5) - Other names: 2,2-Dimethyl-1,3-dioxane

Condensed phase thermochemistry data

Data compiled by: Hussein Y. Afeefy, Joel F. Liebman, and Stephen E. Stein
Quantity | Value | Units | Method | Reference | Comment |
---|---|---|---|---|---|
ΔfH°liquid | -468.9 ± 2.0 | kJ/mol | Ccb | Pihlaja and Luoma, 1968 | |
Quantity | Value | Units | Method | Reference | Comment |
ΔcH°liquid | -3607.2 ± 2.0 | kJ/mol | Ccb | Pihlaja and Luoma, 1968 | Corresponding ΔfHºliquid = -468.86 kJ/mol (simple calculation by NIST; no Washburn corrections) |

Phase change data

Data compiled by: Thermodynamics Research Center, NIST Boulder Laboratories, Chris Muzny director
Quantity | Value | Units | Method | Reference | Comment |
---|---|---|---|---|---|
Tboil | 397.65 | K | N/A | Eliel and Knoeber, 1968 | Uncertainty assigned by TRC = 1.5 K |

Reaction thermochemistry data

Data compiled by: Hussein Y. Afeefy, Joel F. Liebman, and Stephen E. Stein
Individual Reactions
By formula: C3H8O2 + C3H6O = C6H12O2 + H2O
Quantity | Value | Units | Method | Reference | Comment |
---|---|---|---|---|---|
ΔrH° | -23. | kJ/mol | Eqk | Anteunis and Rommelaere, 1970 | liquid phase |

Gas phase ion energetics data

Data compiled as indicated in comments:
LBLHLM - Sharon G. Lias, John E. Bartmess, Joel F. Liebman, John L. Holmes, Rhoda D. Levin, and W. Gary Mallard
Ionization energy determinations
IE (eV) | Method | Reference | Comment |
---|---|---|---|
9.84 | PE | Asfandiarov and Zykov, 1983 | Vertical value; LBLHLM |

Kovats' RI, non-polar column, isothermal

Column type | Active phase | Temperature (C) | I | Reference | Comment |
---|---|---|---|---|---|
Packed | Apiezon L | 120. | 796. | Bogoslovsky, Anvaer, et al., 1978 | Celite 545 |
Packed | Apiezon L | 160. | 820. | Bogoslovsky, Anvaer, et al., 1978 | Celite 545 |

References

Pihlaja and Luoma, 1968
Pihlaja, K.; Luoma, S.,
Heats of formation and conformational energies of 1,3-dioxane and its methyl homologues,
Acta Chem. Scand., 1968, 22, 2401-2414. [all data]
Eliel and Knoeber, 1968
Eliel, E.L.; Knoeber, M.C.,
Conformational Analysis XVI. 1,3-Dioxanes,
J. Am. Chem. Soc., 1968, 90, 3444. [all data]
Anteunis and Rommelaere, 1970
Anteunis, M.; Rommelaere, Y.,
NMR experiments on acetals. XXIX. The ease of acetonide formation of some glycols,
Bull. Soc. Chim. Belg., 1970, 79, 523-530. [all data]
Asfandiarov and Zykov, 1983
Asfandiarov, N.L.; Zykov, B.G.,
Photoelectron spectra of methyl-substituted 1,3-Dioxanes,
Bull. Acad. Sci. USSR, Div. Chem. Sci., 1983, 10, 2069, In original 2293. [all data]
Bogoslovsky, Anvaer, et al., 1978
Bogoslovsky, Yu.N.; Anvaer, B.I.; Vigdergauz, M.S.,
Chromatographic constants in gas chromatography (in Russian), Standards Publ. House, Moscow, 1978, 192. [all data]