Benzonitrile, 3-bromo-
- Formula: C7H4BrN
- Molecular weight: 182.017
- IUPAC Standard InChIKey: STXAVEHFKAXGOX-UHFFFAOYSA-N
- CAS Registry Number: 6952-59-6
- Chemical structure:
View 3d structure (requires JavaScript / HTML 5) - Other names: Benzonitrile, m-bromo-; m-Bromobenzonitrile; 1-Bromo-3-cyanobenzene; 3-Bromobenzonitrile; NSC 59731; 3-Bromobenzoic acid nitrile

Phase change data

Data compiled by: Robert L. Brown and Stephen E. Stein
Quantity | Value | Units | Method | Reference | Comment |
---|---|---|---|---|---|
Tboil | 498.2 | K | N/A | Weast and Grasselli, 1989 | |
Tboil | 498. | K | N/A | Buckingham and Donaghy, 1982 | |
Quantity | Value | Units | Method | Reference | Comment |
Tfus | 311. to 312. | K | N/A | Buckingham and Donaghy, 1982 |
Reduced pressure boiling point
Tboil (K) | Pressure (bar) | Reference |
---|---|---|
391.6 | 0.027 | Buckingham and Donaghy, 1982 |

Gas phase ion energetics data

Data compiled by: Henry M. Rosenstock, Keith Draxl, Bruce W. Steiner, and John T. Herron
Appearance energy determinations
Ion | AE (eV) | Other Products | Method | Reference | Comment |
---|---|---|---|---|---|
C7H4NBr+ | 9.87 ± 0.05 | ? | EI | Buchs, 1970 |

References

Weast and Grasselli, 1989
CRC Handbook of Data on Organic Compounds, 2nd Editon, Weast,R.C and Grasselli, J.G., ed(s)., CRC Press, Inc., Boca Raton, FL, 1989, 1. [all data]
Buckingham and Donaghy, 1982
Buckingham, J.; Donaghy, S.M.,
Dictionary of Organic Compounds: Fifth Edition, Chapman and Hall, New York, 1982, 1. [all data]
Buchs, 1970
Buchs, A.,
Etude par spectrometrie de masse de l'ionisation de benzonitriles, de phenylacetonitriles et de N,N-dimethylanilines substitues,
Helv. Chim. Acta, 1970, 53, 2026. [all data]