8,9-Dioxabicyclo[5.2.1]decane
- Formula: C8H14O2
- Molecular weight: 142.1956
- IUPAC Standard InChIKey: FFDYIXXGKKMDCQ-UHFFFAOYSA-N
- CAS Registry Number: 69492-24-6
- Chemical structure:
View 3d structure (requires JavaScript / HTML 5) - Permanent link for this species. Use this link for bookmarking this species for future reference.

Gas phase ion energetics data

Data compiled as indicated in comments:
LBLHLM - Sharon G. Lias, John E. Bartmess, Joel F. Liebman, John L. Holmes, Rhoda D. Levin, and W. Gary Mallard
Ionization energy determinations
IE (eV) | Method | Reference | Comment |
---|---|---|---|
9.2 | PE | Gleiter, Dobler, et al., 1984 | Vertical value; LBLHLM |

References

Gleiter, Dobler, et al., 1984
Gleiter, R.; Dobler, W.; Eckert-Maksic, M.; Bloodworth, A.J.; Eggelte, H.J.; Cremer, D.,
Photoelectron spectra of dioxabicyclo[n.2.1]alkanes,
J. Org. Chem., 1984, 49, 3716. [all data]