Pyridine, 1-oxide
- Formula: C5H5NO
- Molecular weight: 95.0993
- IUPAC Standard InChIKey: ILVXOBCQQYKLDS-UHFFFAOYSA-N
- CAS Registry Number: 694-59-7
- Chemical structure:
View 3d structure (requires JavaScript / HTML 5) - Other names: Pyridine oxide; Pyridine N-oxide

Gas phase thermochemistry data

Data compiled by: Hussein Y. Afeefy, Joel F. Liebman, and Stephen E. Stein
Quantity | Value | Units | Method | Reference | Comment |
---|---|---|---|---|---|
ΔfH°gas | 87.9 ± 2.5 | kJ/mol | Cm | Shaofeng and Pilcher, 1988 | |
ΔfH°gas | 87.9 ± 2.5 | kJ/mol | Cm | Shaofeng and Pilcher, 1988 |

Condensed phase thermochemistry data

Data compiled by: Hussein Y. Afeefy, Joel F. Liebman, and Stephen E. Stein
Quantity | Value | Units | Method | Reference | Comment |
---|---|---|---|---|---|
ΔfH°solid | 7.7 | kJ/mol | Cm | da Silva, Chagas, et al., 1988 | reaction calorimetry(solution) |
ΔfH°solid | 8.6 ± 2.3 | kJ/mol | Cm | Shaofeng and Pilcher, 1988 | |
ΔfH°solid | 8.6 ± 2.3 | kJ/mol | Cm | Shaofeng and Pilcher, 1988 |

Phase change data

Data compiled as indicated in comments:
ALS - Hussein Y. Afeefy, Joel F. Liebman, and Stephen E. Stein
AC - William E. Acree, Jr., James S. Chickos
Quantity | Value | Units | Method | Reference | Comment |
---|---|---|---|---|---|
ΔsubH° | 81.9 ± 1.5 | kJ/mol | V | da Silva, Chagas, et al., 1988 | reaction calorimetry(solution); ALS |
ΔsubH° | 79.3 ± 1.0 | kJ/mol | C | Shaofeng and Pilcher, 1988 | ALS |
ΔsubH° | 79.3 ± 1.0 | kJ/mol | C | Shaofeng and Pilcher, 1988 | ALS |
ΔsubH° | 79.3 ± 1.0 | kJ/mol | N/A | Shaofeng and Pilcher, 1988 | AC |

Reaction thermochemistry data

Data compiled by: Hussein Y. Afeefy, Joel F. Liebman, and Stephen E. Stein
Individual Reactions
3 +
= 3
+ KClO3
By formula: 3C5H5NO + ClK = 3C5H5N + KClO3
Quantity | Value | Units | Method | Reference | Comment |
---|---|---|---|---|---|
ΔrH° | 315. ± 10. | kJ/mol | Cm | Shaofeng and Pilcher, 1988 | solid phase |
3 +
= 3
+ KBrO3
By formula: 3C5H5NO + BrK = 3C5H5N + KBrO3
Quantity | Value | Units | Method | Reference | Comment |
---|---|---|---|---|---|
ΔrH° | 313.6 ± 9.6 | kJ/mol | Cm | Shaofeng and Pilcher, 1988 | solid phase |

Gas phase ion energetics data

Data evaluated as indicated in comments:
HL - Edward P. Hunter and Sharon G. Lias
Data compiled as indicated in comments:
LLK - Sharon G. Lias, Rhoda D. Levin, and Sherif A. Kafafi
Quantity | Value | Units | Method | Reference | Comment |
---|---|---|---|---|---|
Proton affinity (review) | 923.6 | kJ/mol | N/A | Hunter and Lias, 1998 | HL |
Quantity | Value | Units | Method | Reference | Comment |
Gas basicity | 892.9 | kJ/mol | N/A | Hunter and Lias, 1998 | HL |
Ionization energy determinations
IE (eV) | Method | Reference | Comment |
---|---|---|---|
8.38 ± 0.02 | PE | Maier, Muller, et al., 1975 | LLK |
8.46 | PE | Weiner and Lattman, 1974 | Vertical value; LLK |
8.38 ± 0.02 | PE | Maier and Muller, 1974 | Vertical value; LLK |

References

Shaofeng and Pilcher, 1988
Shaofeng, L.; Pilcher, G.,
Enthalpy of formation of pyridine-N-oxide: the dissociation enthalpy of the (N-O) bond,
J. Chem. Thermodyn., 1988, 20, 463-465. [all data]
da Silva, Chagas, et al., 1988
da Silva, M.L.C.P.; Chagas, A.P.; Airoldi, C.,
Heterocyclic N-oxide ligands: A thermochemical study of adducts with zinc, cadmium, and mercury chlorides,
J. Chem. Soc. Dalton Trans., 1988, 2113-2116. [all data]
Hunter and Lias, 1998
Hunter, E.P.; Lias, S.G.,
Evaluated Gas Phase Basicities and Proton Affinities of Molecules: An Update,
J. Phys. Chem. Ref. Data, 1998, 27, 3, 413-656, https://doi.org/10.1063/1.556018
. [all data]
Maier, Muller, et al., 1975
Maier, J.P.; Muller, J.-F.; Kubota, T.,
182. Ionisation energies and the electronic structures of the N-oxides of diazabenzenes,
Helv. Chim. Acta, 1975, 58, 1634. [all data]
Weiner and Lattman, 1974
Weiner, M.A.; Lattman, M.,
Photoelectron spectra of 4-substituted pyridine N-oxides,
Tetrahedron Lett., 1974, 1709. [all data]
Maier and Muller, 1974
Maier, J.P.; Muller, J.-F.,
Ionisation energies of pyridine N-oxides determined by photoelectron spectroscopy,
J. Chem. Soc. Faraday Trans. 2, 1974, 70, 1991. [all data]