1H-Phenalen-1-one,9-dimethylamino-

Gas phase ion energetics data

Data compiled by: Sharon G. Lias, Rhoda D. Levin, and Sherif A. Kafafi

Ionization energy determinations

IE (eV) Method Reference Comment
7.36 ± 0.04PECarnovale, Gan, et al., 1980Vertical value

References

Carnovale, Gan, et al., 1980
Carnovale, F.; Gan, T.H.; Peel, J.B.; Franz, K.-D., The photoelectron spectra of some 1,9-disubstituted phenalenes, J. Chem. Soc. Perkin Trans. 2, 1980, 957. [all data]